program: Gaussian 09
title: 000238900
version: EM64L-G09RevD.01
frameworkgroup: C1[X(C13H10Cl2N2O)]
method: RPBEPBE
basis: SDD
operation: Freq
keyword: #p
keyword: freq=noraman
keyword: PBEPBE/SDD
title: #p freq=noraman PBEPBE/SDD
converged: NO YES NO YES
title: Mulliken charges:
elementType: Cl Cl O N N C C C C C C C C C C C C C H H H H H H H H H H
charge: -0.079723 -0.067388 -0.282096 -0.493681 -0.506709 0.588553 0.508561 0.277772 -0.354700 -0.309670 -0.441339 -0.344787 -0.221382 -0.221162 -0.042518 -0.190975 -0.243561 -0.260057 0.295701 0.301289 0.312912 0.246724 0.311212 0.255915 0.233196 0.232852 0.236902 0.258157
chargesum: 0.00000
title: Mulliken charges with hydrogens summed into heavy atoms:
elementType: Cl Cl O N N C C C C C C C C C C C C C
charge: -0.079723 -0.067388 -0.282096 -0.197980 -0.205419 0.588553 0.508561 0.277772 -0.354700 0.003242 -0.194615 -0.033575 0.034533 0.012035 -0.042518 0.041877 -0.006658 -0.001901
polarizability: 3.14815003e+02 -1.28179383e+01 1.93601445e+02 1.22302773e-03 -9.91695442e-04 6.57200239e+01
1716.lowfreq: -0.0009 -0.0002 0.0016 2.9380 6.4489 11.2896 20.9497 36.0003 56.9044
frequency: 20.7941 35.7296 56.8914 71.2984 86.5531 143.7123 154.6473 169.5112 182.4582 231.5394 260.8763 264.6161 285.0635 362.4908 367.4752 409.6459 426.9554 433.1468 437.4746 483.3198 525.0030 543.8568 576.9322 625.4867 657.7485 660.9462 684.4654 686.4527 703.3331 718.5764 759.8562 775.0096 788.7826 820.1962 857.1675 871.8963 889.1512 911.3363 948.5858 977.9459 991.9205 995.4816 999.7585 1016.0878 1043.0525 1073.9119 1096.9491 1128.1779 1172.3363 1178.5599 1188.2732 1241.8577 1256.1064 1302.5123 1315.4526 1365.2214 1374.3687 1413.8616 1430.7271 1460.8416 1474.9766 1513.6829 1523.7388 1579.9561 1587.8568 1614.0384 1616.8092 1655.6989 3137.8657 3143.6677 3147.0805 3160.3929 3178.1071 3180.1445 3193.8366 3204.2476 3472.0225 3525.6748
redmass: 7.5273 5.5291 9.8455 7.1016 5.4095 10.1773 4.9048 9.6286 5.4158 3.3204 8.2925 4.1353 9.5175 7.0274 9.2995 9.4429 6.8927 2.8800 3.1363 1.6378 7.7494 3.2756 3.7784 6.7455 1.2752 7.1947 2.2700 7.5869 8.3520 3.9986 1.2388 7.0404 1.3075 6.3895 1.6120 1.3407 5.9982 1.3646 1.3540 5.9102 1.3089 1.3082 7.3600 6.4251 1.9867 1.9662 1.5439 1.5522 1.0650 1.1001 2.6929 1.6486 1.6246 1.5703 2.0086 4.2322 6.6540 3.5963 2.6586 2.4720 2.6856 2.1962 2.4205 4.7938 5.1405 7.0054 6.3011 3.5642 1.0927 1.0867 1.0890 1.0919 1.0982 1.0958 1.0954 1.0950 1.0761 1.0762
irintensity: 0.0254 0.0106 0.0095 9.0361 3.0452 8.9279 0.1645 0.1481 0.8871 2.2259 1.7375 3.6590 5.0224 3.5358 11.0872 5.2290 1.8544 0.8287 15.6067 3.6563 16.9537 11.9407 1.1383 0.6165 90.6070 9.3604 39.9023 35.1434 30.1076 4.5035 114.7483 0.2787 56.6986 26.8543 49.8262 5.3908 10.7597 4.8194 5.9707 14.0550 3.4248 4.4572 23.5980 39.7501 4.7758 19.3015 21.2159 1.4056 0.0712 12.6221 335.5304 61.0879 48.6798 155.0824 9.7824 39.7811 316.2802 42.4086 98.4871 75.7237 250.2435 884.6341 194.7608 60.2712 166.9244 226.4672 4.6167 80.3540 6.5872 3.8787 9.6509 11.1680 8.6148 2.5926 14.0500 8.9524 61.8152 15.3533
temp: 298.150 k
press: 1.00000 atm
elementType: 17 17 8 7 7 6 6 6 6 6 6 6 6 6 6 6 6 6 1 1 1 1 1 1 1 1 1 1
symmnumber: 1
zpe: 531274.6 jmol-1
zpe.correction: 0.202352 hartree
zpe.thermalcorrener: 0.218266 hartree
zpe.thermalcorrenthalpy: 0.219210 hartree
zpe.thermalcorrgfe: 0.156577 hartree
zpe.sumelectzpe: -1604.997281 hartree
zpe.sumelectthermal: -1604.981366 hartree
zpe.sumelectthermalent: -1604.980422 hartree
zpe.sumelectthermalfe: -1605.043055 hartree
dipole: 2.1561 0.6629 -0.0001
dipole: 2.2557
quadrupole: -112.8216 -113.2945 -124.6930
quadrupole: 3.4678 0.0005 -0.0006
quadrupole: 4.1148 3.6418 -7.7566 3.4678 0.0005 -0.0006
hfenergy: -1605.1996325 hartree
pointgroup: C01 [X(C13H10Cl2N2O1)]
dipole: -0.8518012 0.2489966 0.0000148 debye
polarizability: 314.4357679|14.4956552|193.9806742|-0.0146702|-0.0253499|65.7200295 unknown
InChI: InChI=1S/C13H10Cl2N2O/c14-9-4-3-5-10(8-9)16-13(18)17-12-7-2-1-6-11(12)15/h1-8,16-17H
charge 0 multiplicity 1
28 atoms
Cl -3.218415 2.823712 -0.000383
Cl 5.995376 1.91158 -0.000741
O  -0.176526 -1.575044 0.000388
N  -1.319359 0.491993 0.0001
N  1.006895 0.467027 -0.000044
C  -2.665643 0.060236 0.000179
C  2.351913 0.007873 -0.000067
C  -0.164884 -0.310435 0.000197
C  -3.695659 1.042237 -0.000017
C  -3.068204 -1.305061 0.000448
C  3.366086 1.006189 -0.000339
C  2.715336 -1.366184 0.000151
C  -5.059522 0.718405 0.000037
C  -4.43711 -1.64158 0.00051
C  4.712315 0.611116 -0.000385
C  4.081689 -1.716088 0.000097
C  -5.437818 -0.644074 0.000306
C  5.104881 -0.740013 -0.00017
H  -1.212822 1.51191 -0.000088
H  0.90169 1.484048 -0.000234
H  -2.292038 -2.072088 0.000609
H  3.108134 2.071231 -0.000512
H  1.934753 -2.127529 0.000352
H  -5.809864 1.513964 -0.000128
H  -4.720981 -2.699187 0.000724
H  4.358503 -2.77576 0.000266
H  -6.498695 -0.912196 0.000356
H  6.161569 -1.01878 -0.000213
