program: Gaussian 09
title: 000238875
version: EM64L-G09RevD.01
frameworkgroup: C1[X(C5H8OS2)]
method: RPBEPBE
basis: SDD
operation: Freq
keyword: #pfreq=noraman
keyword: PBEPBE/SDD
title: #p freq=noraman PBEPBE/SDD
converged: YES YES NO NO
title: Mulliken charges:
elementType: S S O C C C C C H H H H H H H H
charge: 0.198007 0.067133 -0.150777 -0.746744 0.041324 -0.354847 -0.516781 -0.546679 0.265314 0.302700 0.253752 0.251570 0.247830 0.246094 0.224589 0.217514
chargesum: 0.00000
title: Mulliken charges with hydrogens summed into heavy atoms:
elementType: S S O C C C C C
charge: 0.198007 0.067133 -0.150777 -0.178729 0.295076 -0.354847 0.228713 -0.104575
polarizability: 1.29562704e+02 3.11496793e+00 1.01883256e+02 -1.78017862e+00 -2.63283408e+00 5.60285038e+01
1716.lowfreq: -0.0014 -0.0013 0.0023 8.0951 10.4321 11.6101 43.4961 49.9054 101.5617
frequency: 43.4010 49.8825 101.5596 125.9125 185.1570 215.6304 219.7261 284.1456 339.8011 393.9060 448.1160 494.0026 502.6775 565.8465 702.9853 859.6913 869.6976 937.1916 951.6672 970.2532 1013.2687 1092.9409 1109.4178 1144.5074 1176.6403 1217.0510 1255.5715 1290.0310 1408.4741 1427.2227 1435.5759 1456.2500 1457.9939 1651.8857 2993.4098 3005.0810 3091.4171 3098.0184 3101.2013 3126.2459 3148.8682 3202.4952
redmass: 4.5048 4.7543 2.5553 2.6706 1.2310 3.5369 3.5474 3.1686 6.6156 2.3683 3.8825 9.5127 12.2535 2.8812 2.1373 8.2776 1.4692 2.0945 1.3354 6.0622 1.1542 1.2476 1.5663 1.4344 6.6000 1.3211 1.2131 1.2100 1.1081 1.1693 1.1801 1.0482 1.0501 4.5270 1.0298 1.0608 1.0609 1.1054 1.1017 1.0956 1.1031 1.1144
irintensity: 0.4994 2.8337 1.4020 4.8239 1.7989 5.6311 0.9287 4.6182 1.3207 4.2966 9.6641 12.0962 0.7352 18.5461 38.5550 90.4122 17.3653 9.1724 80.7454 170.3957 10.8995 0.0318 21.4989 27.6069 327.7816 4.3893 19.8798 2.5742 13.7927 19.4509 22.3986 43.6106 19.9306 5.4917 20.6593 18.8955 7.5800 21.2614 1.3163 4.9290 17.5603 20.9470
temp: 298.150 k
press: 1.00000 atm
elementType: 16 16 8 6 6 6 6 6 1 1 1 1 1 1 1 1
symmnumber: 1
zpe: 312014.9 jmol-1
zpe.correction: 0.118840 hartree
zpe.thermalcorrener: 0.129017 hartree
zpe.thermalcorrenthalpy: 0.129961 hartree
zpe.thermalcorrgfe: 0.081853 hartree
zpe.sumelectzpe: -1065.998891 hartree
zpe.sumelectthermal: -1065.988714 hartree
zpe.sumelectthermalent: -1065.987770 hartree
zpe.sumelectthermalfe: -1066.035878 hartree
dipole: -0.6768 -3.6272 0.2488
dipole: 3.6982
quadrupole: -55.2722 -65.6387 -61.8188
quadrupole: -7.2283 -0.8720 -0.0268
quadrupole: 5.6377 -4.7288 -0.9089 -7.2283 -0.8720 -0.0268
hfenergy: -1066.1177311 hartree
pointgroup: C01 [X(C5H8O1S2)]
dipole: -0.2719533 -0.3066006 1.3960801 debye
dipolederiv: -0.6983646 0.0888862 0.3053366 0.1639681 -0.096361 -0.0385891 0.4115038 -0.1205195 -0.589365 -0.3163874 0.1168773 -0.0825022 0.0793516 -0.2766401 0.2621916 0.0949406 0.1959664 -0.8390373 -1.1451898 0.6356779 -0.3980607 0.6385642 -0.6834614 0.3536335 -0.1126452 0.1703787 -0.5176793 0.5328868 -0.1067264 -0.0148513 -0.1942564 0.1564893 0.0579986 0.2119824 0.0086898 0.0178978 0.0535255 0.0635256 -0.0526353 0.1840148 -0.1478208 0.0909522 0.037159 0.1287295 -0.00585 1.2423991 -0.7659603 0.0542375 -0.6762499 0.4636954 -0.5084168 -0.6326206 -0.2050334 1.4177767 0.3194344 -0.0409769 0.0919412 -0.0969949 0.3604787 -0.0778927 0.2603967 -0.1608076 0.360534 -0.1976283 0.1116237 -0.0143633 0.0433145 -0.1703907 0.2258376 -0.0733964 0.2404759 -0.0296521 -0.005539 0.0765775 0.0469028 0.0177119 0.0469184 -0.0644655 -0.0162878 -0.1130176 -0.0018688 -0.0019144 -0.0503751 -0.0011224 -0.0134937 0.0595188 0.0127115 -0.1028339 0.1188097 0.0753675 0.0905192 -0.0051079 0.0636453 -0.0457257 0.0738141 -0.0766667 0.0054466 -0.1044181 -0.001778 -0.056474 0.1187218 -0.0119197 0.1075761 0.0622029 0.0193559 0.0534747 -0.0148034 0.089239 -0.0160042 -0.1166742 0.0326231 -0.0785792 0.0262563 0.0436755 -0.0694109 0.0901154 0.0101747 0.1345833 -0.0107817 -0.0017448 -0.0051591 -0.0550692 -0.0805682 -0.0951109 -0.0084088 -0.0497751 -0.0260532 -0.0909229 -0.0299137 -0.1408166 0.1003642 -0.081693 -0.0149769 -0.0958339 0.0831906 0.0902067 -0.0243645 0.0124267 0.0167743 0.080005 -0.1380644 0.0423787 -0.1303232 -0.0191747 unknown
polarizability: 123.6268366|-18.7156661|64.5796019|-8.2250137|-10.0344044|99.2680249 unknown
InChI: InChI=1S/C5H8OS2/c1-3-4-8-5(7)6-2/h3H,1,4H2,2H3
charge 0 multiplicity 1
16 atoms
S  0.02959 -0.275432 0.593491
S  0.763551 0.165678 -2.441019
O  2.18892 -1.266894 -0.72457
C  -1.395942 0.805245 -0.085243
C  -2.525995 -0.029528 -0.614065
C  1.069836 -0.488072 -0.922209
C  2.500298 -1.855588 0.605438
C  -3.762865 -0.073665 -0.055901
H  -1.689245 1.434436 0.770561
H  -0.922877 1.413579 -0.877622
H  -2.305891 -0.608413 -1.520916
H  3.434611 -2.408817 0.439356
H  1.692955 -2.538321 0.922966
H  2.646913 -1.058628 1.355251
H  -4.564064 -0.679333 -0.493048
H  -4.011395 0.498753 0.846626
