program: Gaussian 09
title: 000238877
version: EM64L-G09RevD.01
frameworkgroup: C1[X(C11H12OS2)]
method: RPBEPBE
basis: SDD
operation: Freq
keyword: #p
keyword: freq=noraman
keyword: PBEPBE/SDD
title: #p freq=noraman PBEPBE/SDD
converged: YES YES NO NO
title: Mulliken charges:
elementType: S S O C C C C C C C C C C C H H H H H H H H H H H H
charge: 0.194197 0.058070 -0.142050 0.485978 -0.466760 -0.374631 -0.380329 -0.222967 -0.223155 -0.227178 -0.362003 -0.742810 0.040405 -0.547783 0.243698 0.241619 0.235557 0.234828 0.231006 0.231033 0.232947 0.264075 0.301344 0.253906 0.224035 0.216968
chargesum: 0.00000
title: Mulliken charges with hydrogens summed into heavy atoms:
elementType: S S O C C C C C C C C C C C
charge: 0.194197 0.058070 -0.142050 0.485978 0.018556 -0.139073 -0.145501 0.008039 0.007878 0.005769 -0.362003 -0.177391 0.294311 -0.106780
polarizability: 2.46925839e+02 -1.37916919e+01 1.28448196e+02 1.58881419e+00 6.30619254e-03 1.21503697e+02
1716.lowfreq: -6.6120 -0.0017 0.0010 0.0030 4.4548 9.2110 15.3230 17.4734 40.0354
frequency: 14.2744 16.9863 40.0273 51.2782 64.7850 101.8251 129.9819 147.3380 214.7022 225.4677 282.3533 332.4626 353.9653 374.9027 401.6601 422.8526 473.4047 501.8426 529.7793 565.7216 602.7706 616.8799 701.0514 702.9974 754.4692 809.3422 831.9490 852.9529 868.7589 929.7692 936.2492 950.6417 953.8097 966.5065 977.7611 990.9441 999.7410 1013.6044 1026.6842 1088.5274 1106.5625 1148.9337 1173.6619 1177.2479 1188.7106 1216.7675 1230.9409 1253.9903 1288.1897 1326.8033 1341.5301 1388.0172 1407.2302 1434.6540 1442.0155 1463.6845 1487.1413 1597.1127 1616.7321 1651.6153 3002.5767 3004.9158 3073.7141 3090.3414 3101.4741 3124.9969 3126.2764 3126.7326 3138.7335 3152.0302 3167.6490 3201.7214
redmass: 4.2557 4.5999 4.9388 5.3552 4.8854 2.8338 5.9201 6.1270 3.4899 6.0629 2.9529 2.2664 7.6584 3.4260 2.7822 3.1091 4.4685 12.3709 5.3831 2.8554 5.5168 6.3390 1.7806 2.0856 2.1943 5.7621 3.7779 1.2484 1.4681 1.5272 2.0942 1.3424 1.6115 7.8359 1.3955 5.9391 1.3420 1.1520 2.1716 1.5219 1.6135 5.4584 1.0623 1.0638 1.1210 1.3230 2.3930 1.1900 1.2145 1.2726 1.4240 8.6833 1.1075 1.1805 2.1949 1.1109 2.4215 6.1182 6.1735 4.5275 1.0562 1.0609 1.1089 1.0609 1.1018 1.0857 1.0955 1.0886 1.0920 1.0963 1.1017 1.1144
irintensity: 0.0300 0.2034 0.9861 0.3348 1.2667 0.9790 1.8488 0.2625 3.8264 4.4079 6.0466 1.4082 2.4137 2.5977 0.0100 14.3386 17.1384 0.0687 35.4350 23.8260 1.2106 0.1153 53.6455 34.6905 84.6303 23.2616 8.1756 0.0040 16.0448 17.5592 18.1101 94.6692 3.9923 347.0459 0.0248 2.7435 0.3227 9.3648 2.0306 6.9569 76.4664 518.6431 0.5592 2.1452 1.3477 4.2066 18.4325 18.5220 2.8329 0.2032 11.4379 1.0218 15.3314 25.0175 9.4397 12.7306 5.5537 0.7982 0.2134 6.0065 13.7773 22.2260 9.6916 8.2052 1.4326 4.9657 4.6424 2.2484 12.5463 35.1119 22.4207 21.0202
temp: 298.150 k
press: 1.00000 atm
elementType: 16 16 8 6 6 6 6 6 6 6 6 6 6 6 1 1 1 1 1 1 1 1 1 1 1 1
symmnumber: 1
zpe: 520816.5 jmol-1
zpe.correction: 0.198369 hartree
zpe.thermalcorrener: 0.213144 hartree
zpe.thermalcorrenthalpy: 0.214088 hartree
zpe.thermalcorrgfe: 0.152233 hartree
zpe.sumelectzpe: -1296.645926 hartree
zpe.sumelectthermal: -1296.631151 hartree
zpe.sumelectthermalent: -1296.630207 hartree
zpe.sumelectthermalfe: -1296.692062 hartree
dipole: -1.0854 -3.2358 -1.1455
dipole: 3.6001
quadrupole: -78.2586 -105.7703 -91.2833
quadrupole: -5.2029 -1.9870 -4.3725
quadrupole: 13.5122 -13.9996 0.4874 -5.2029 -1.9870 -4.3725
hfenergy: -1296.844295 hartree
pointgroup: C01 [X(C11H12O1S2)]
dipole: 0.4677062 -1.2799335 -0.3862239 debye
dipolederiv: -0.6358729 -0.2898875 -0.1513545 -0.4625555 -0.6961897 -0.0632682 -0.0910926 -0.0895208 -0.1082764 -0.6061454 0.2484992 0.117275 0.1673391 -0.7930552 -0.1959238 0.1073472 -0.1697139 -0.2025165 -2.242824 0.2568264 0.3180413 0.1512515 -0.3880049 -0.0821188 0.3959178 -0.0906294 -0.2493325 -0.0155972 -0.0130797 0.0023836 -0.1152332 -0.0990726 -0.0025893 -0.0196932 -0.0134952 -0.0091271 1.1099201 -0.0456521 -0.1214166 -0.4920328 0.3414776 0.0644156 -0.2399299 0.0108222 0.3431115 -0.0386059 0.0082677 0.1122815 0.0061503 -0.1181029 -0.0302001 -0.0147749 -0.0258787 0.0167337 -0.0626928 0.0457949 -0.0756268 0.0003167 -0.1130625 -0.0394876 0.0508812 -0.0514838 0.045339 -0.1084496 0.0351903 -0.0777258 0.0458495 -0.1159611 -0.0810204 -0.0890346 -0.0673917 0.086938 -0.0245002 -0.0037457 0.1330829 0.0023005 -0.137189 -0.012822 0.1508005 -0.0234848 0.0257022 0.0726965 0.0708111 -0.0066852 0.0553587 -0.1239228 -0.0306655 -0.0074448 -0.0327647 -0.0369144 2.0370893 -0.2123476 -0.3259264 0.5901918 1.451706 0.3464552 -0.2518591 0.3532058 0.0323977 0.621634 0.132195 0.0905258 -0.1076469 0.0079258 -0.0760121 0.0197179 -0.0401305 0.1104131 -0.0983805 0.0759317 0.1154219 0.0073924 0.002616 -0.1115438 0.252545 -0.0225961 -0.0128315 -0.3069557 0.070876 0.0987212 0.1328366 -0.0055294 -0.1782614 0.0175375 -0.2005555 -0.1007582 -0.0436377 -0.0148927 -0.034371 0.1282006 0.0235992 -0.0360631 -0.0736741 -0.0678293 -0.0431927 0.0037878 0.0044665 0.0326889 0.1001689 -0.0202471 0.0219312 0.1116087 0.0887771 -0.0350172 0.0186366 -0.0120972 -0.1125108 -0.0131707 0.1335254 0.0144545 -0.1093315 0.0217812 -0.0020315 0.084158 -0.0470473 0.0724788 -0.0422912 0.1176202 0.0658435 0.0642631 0.0594348 -0.0503945 0.0487267 -0.032567 0.0552809 -0.0467887 0.1322532 0.0706929 0.0770192 0.0693307 -0.0740023 -0.0165659 -0.0060497 -0.0968198 -0.0112229 0.1489657 0.0272626 -0.1193641 0.0260687 -0.02735 -0.1170358 -0.0616766 0.0230973 -0.0698911 0.1392675 0.0231928 0.0229691 0.0221916 0.0897113 -0.0309539 -0.0722634 0.0258536 -0.0398724 -0.0138937 0.1157712 -0.0286617 0.0372517 0.0683284 0.0102584 -0.0072798 -0.0520086 0.1522694 0.0938446 -0.0758357 -0.0366764 -0.0176791 0.0265833 0.136787 -0.0700085 -0.0009318 -0.0301709 -0.0157878 0.0928577 -0.0301906 0.0393511 0.0517888 0.0899221 -0.0102405 -0.1092256 -0.0337894 0.0819138 0.0746277 -0.1672438 0.0594845 -0.015658 0.1146011 -0.0500234 -0.0325298 -0.0749606 -0.0346963 0.0983068 0.0083643 0.1254542 0.0703556 unknown
polarizability: 246.3102882|16.1084189|127.3903062|2.7339697|2.8601306|123.1771377 unknown
InChI: InChI=1S/C11H12OS2/c1-2-8-14-11(13)12-9-10-6-4-3-5-7-10/h2-7H,1,8-9H2
charge 0 multiplicity 1
26 atoms
S  -2.188801 -1.291325 0.545317
S  -2.185968 1.802175 1.151944
O  -0.041405 0.380023 0.509779
C  2.15146 -0.526962 -0.048607
C  0.705597 -0.895987 0.138903
C  2.62363 -0.096672 -1.31443
C  3.057798 -0.601448 1.038992
C  3.979315 0.256282 -1.490284
C  4.414427 -0.249853 0.865682
C  4.877473 0.179443 -0.400017
C  -1.397513 0.372489 0.738227
C  -4.022321 -0.87622 0.90003
C  -4.76051 -0.493011 -0.349867
C  -5.763287 -1.229357 -0.893599
H  0.246483 -1.288785 -0.786425
H  0.558524 -1.616716 0.963641
H  1.926868 -0.031789 -2.158776
H  2.698326 -0.928263 2.022199
H  4.335053 0.588834 -2.471471
H  5.107334 -0.309864 1.711929
H  5.930087 0.451629 -0.535954
H  -4.420475 -1.789352 1.371097
H  -3.977875 -0.044483 1.626486
H  -4.457049 0.457183 -0.809045
H  -6.291658 -0.897487 -1.793881
H  -6.088312 -2.179083 -0.450267
