program: Gaussian 09
title: 000238867
version: EM64L-G09RevD.01
frameworkgroup: C1[X(C8H7N3O2S)]
method: RPBEPBE
basis: SDD
operation: Freq
keyword: #p
keyword: freq=noraman
keyword: PBEPBE/SDD
title: #p freq=noraman PBEPBE/SDD
converged: NO NO NO NO
title: Mulliken charges:
elementType: S O O N N N C C C C C C C C H H H H H H H
charge: 0.252081 -0.263836 -0.243244 -0.401898 -0.346560 -0.071969 0.156417 0.337376 0.156138 -0.248108 -0.687167 -0.144376 0.143657 -0.723317 0.303303 0.321605 0.365098 0.352205 0.244125 0.244427 0.254042
chargesum: 0.00000
title: Mulliken charges with hydrogens summed into heavy atoms:
elementType: S O O N N N C C C C C C C C
charge: 0.252081 -0.263836 -0.243244 -0.036800 0.005645 -0.071969 0.156417 0.337376 0.156138 0.055195 -0.365561 -0.144376 0.143657 0.019276
polarizability: 2.15368729e+02 1.64385410e+01 1.38460851e+02 2.08740404e-02 3.86982282e-03 5.49408230e+01
1716.lowfreq: -11.9498 -1.1971 -0.0018 -0.0010 0.0014 1.9320 54.3314 62.9354 74.0610
frequency: 54.2347 62.9348 74.0488 115.2371 154.4977 171.8155 238.1149 245.3212 287.6833 350.9051 355.3140 381.3285 417.4767 503.4559 521.6449 547.6465 558.3104 594.0105 609.4776 648.6037 674.8632 705.7602 748.8040 749.7490 786.6996 787.6527 817.4228 868.6506 931.9409 945.5329 958.5518 1036.0234 1048.2458 1113.6111 1150.0708 1175.9277 1206.8354 1288.1257 1314.9138 1363.1674 1387.8116 1393.4328 1450.6037 1456.0260 1457.2924 1508.4216 1546.3561 1608.6990 1639.8882 1682.3665 2990.7804 3071.8696 3114.6178 3185.8294 3254.7775 3523.8708 3561.7774
redmass: 5.3458 5.2947 1.1409 5.8921 7.1311 8.6783 3.6561 5.6048 6.9111 7.3510 7.2909 8.7021 3.4197 4.9716 8.1790 7.4034 6.2028 7.1647 5.4170 1.4455 4.4831 2.1990 8.3536 2.6849 2.1689 5.4432 1.4883 7.3231 1.3679 3.0771 2.6716 1.4141 1.9926 2.4279 3.0737 1.9704 2.9438 3.2056 3.1747 1.8837 2.3852 1.2630 2.6539 1.0460 1.1290 7.8270 6.5061 6.5063 7.2303 5.5055 1.0368 1.0980 1.0991 1.0945 1.0961 1.0771 1.0786
irintensity: 2.0719 0.0011 0.7895 1.5612 4.7675 5.8136 3.6453 5.8142 0.4374 0.3663 9.1453 13.7485 8.3869 0.4792 12.1788 6.9097 13.1627 35.1580 16.5892 65.1297 9.7416 0.0423 5.0096 82.9372 77.1907 25.2797 88.8111 3.5104 13.2661 10.8973 10.0443 2.6681 4.8134 21.2164 59.6775 84.1206 31.9661 4.7250 99.8767 8.1553 85.9590 6.4084 55.3808 19.6614 17.0481 22.8109 26.1471 58.7854 229.4829 889.7925 15.4856 12.0538 5.6327 0.8632 17.0490 63.4815 102.3093
temp: 298.150 k
press: 1.00000 atm
elementType: 16 8 8 7 7 7 6 6 6 6 6 6 6 6 1 1 1 1 1 1 1
symmnumber: 1
zpe: 385191.7 jmol-1
zpe.correction: 0.146712 hartree
zpe.thermalcorrener: 0.159019 hartree
zpe.thermalcorrenthalpy: 0.159963 hartree
zpe.thermalcorrgfe: 0.107174 hartree
zpe.sumelectzpe: -1020.857662 hartree
zpe.sumelectthermal: -1020.845355 hartree
zpe.sumelectthermalent: -1020.844410 hartree
zpe.sumelectthermalfe: -1020.897200 hartree
dipole: 2.8749 -3.5082 0.0172
dipole: 4.5357
quadrupole: -94.2397 -83.2441 -89.4699
quadrupole: -3.0911 0.0018 0.0030
quadrupole: -5.2551 5.7404 -0.4853 -3.0911 0.0018 0.0030
hfenergy: -1021.0043738 hartree
pointgroup: C01 [X(C8H7N3O2S1)]
dipole: -1.2034289 0.042167 1.3169692 debye
dipolederiv: -0.4634638 -0.0556711 -0.1935165 -0.0250336 0.0999214 -0.0567642 0.1114427 -0.0375322 -0.3326534 -0.6190641 -0.0190201 -0.026152 -0.0282523 -0.3654483 -0.0702594 -0.1133098 -0.0749498 -1.0921226 -1.6903097 -0.1117524 -0.299543 -0.0998904 -0.3955369 -0.0308093 -0.1820715 -0.0233941 -0.5134097 -0.9183154 -0.0739279 -0.4001332 -0.0763021 -0.3545584 -0.0544378 -0.4279193 -0.0559972 -0.6555608 -1.6318486 -0.1357393 -0.5344581 -0.0392367 -0.305292 -0.0445605 0.5058655 0.022981 -0.402228 -0.786731 -0.0619827 -0.2311837 -0.0494706 -0.1909852 -0.0427636 -0.11885 -0.0358539 -0.4609772 0.094733 0.0298061 0.2244561 0.0085663 -0.0452174 -0.0435051 -0.0223742 -0.0598617 -0.6687491 0.3878658 0.0247994 0.0379506 0.0147051 0.0577661 -0.0067121 -0.0334647 -0.0095068 -0.0274395 1.0886565 0.0562647 0.0329676 0.0672932 0.2778265 0.103043 0.1518825 0.109525 1.3464588 0.8476834 0.1168906 0.6566745 0.0742778 -0.0053127 0.0875421 0.1961856 0.0570757 0.4629219 0.3466432 0.0540709 0.142287 0.041238 -0.2707653 0.0221104 0.0082068 0.0133768 -0.145506 0.432792 0.0478326 0.1324989 0.0268474 -0.0796333 0.1037969 -0.0965614 0.0902605 0.8684522 2.3242694 0.1627513 0.3706702 0.1045139 0.3362983 0.0819494 -0.2470971 0.0418365 0.9520844 -0.1364675 -0.0061552 0.0747421 -0.0062376 0.0736331 -0.0096584 0.1165773 -0.0092314 -0.0887051 0.130503 0.0012408 0.0423495 0.0047437 0.1698645 -0.0063273 0.0819737 -0.003607 0.0729965 0.1554084 -0.000399 0.0388863 -0.0031555 0.2215261 -0.0053296 0.007542 -0.0077346 0.1415717 0.1906417 -0.0140016 -0.0474823 -0.0145102 0.3376194 -0.0172096 -0.053737 -0.0175336 0.1890338 0.1542868 -0.0120039 0.0061757 -0.0043348 0.349548 -0.0058444 0.0885473 -0.0005533 0.2821146 0.0010102 0.0900993 0.0155109 0.1185292 0.0017483 0.0156628 -0.0085432 0.0629879 0.0628673 0.028616 -0.0791425 0.0358148 -0.1107898 -0.0409206 0.007759 0.0270547 -0.0405046 0.0751956 0.0630906 -0.0139597 -0.0785156 -0.003501 0.1279182 -0.0276825 0.0086502 -0.0217831 -0.0663455 unknown
polarizability: 212.6512811|12.0154564|56.6114205|19.5208115|9.3636885|139.5077018 unknown
InChI: InChI=1S/C8H7N3O2S/c1-4-10-6(3-14-4)5-2-9-8(13)11-7(5)12/h2-3,9,11H,1H3
charge 0 multiplicity 1
21 atoms
S  -3.467622 -0.316001 -1.469868
O  1.078171 -0.116857 -2.567434
O  4.468404 0.396197 0.613476
N  2.718911 0.140766 -0.942464
N  2.236459 0.321187 1.338902
N  -1.915315 -0.001295 0.671537
C  0.393466 0.057725 -0.219641
C  -1.051317 -0.057779 -0.450418
C  1.352867 0.015722 -1.339026
C  0.883264 0.208667 1.066937
C  -1.691145 -0.221196 -1.674806
C  -3.188533 -0.115856 0.346076
C  3.241397 0.293701 0.348872
C  -4.343977 -0.094938 1.302199
H  0.191564 0.242366 1.911621
H  -1.223956 -0.288955 -2.653741
H  3.405881 0.114314 -1.703339
H  2.573398 0.43142 2.297188
H  -5.04606 0.72628 1.070389
H  -4.914822 -1.040614 1.267302
H  -3.958038 0.047146 2.324139
