program: Gaussian 09
title: 000238860
version: EM64L-G09RevD.01
frameworkgroup: C1[X(C11H8N2)]
method: RPBEPBE
basis: SDD
operation: Freq
keyword: #pfreq=noraman
keyword: PBEPBE/SDD
title: #p freq=noraman PBEPBE/SDD
converged: YES YES YES YES
title: Mulliken charges:
elementType: N N C C C C C C C C C C C H H H H H H H H
charge: -0.675061 -0.041709 0.243563 0.428240 0.143938 0.304280 -0.449764 -0.374405 -0.434126 -0.433702 -0.238625 -0.250610 -0.312228 0.239948 0.255564 0.241879 0.225573 0.230701 0.230391 0.317561 0.348592
chargesum: 0.00000
title: Mulliken charges with hydrogens summed into heavy atoms:
elementType: N N C C C C C C C C C C C
charge: -0.008908 -0.041709 0.243563 0.428240 0.143938 0.304280 -0.209816 -0.118840 -0.192247 -0.208129 -0.007923 -0.020219 -0.312228
polarizability: 1.99527674e+02 -3.11439535e+00 1.57833775e+02 -4.94949332e-03 -8.22513320e-04 5.09826535e+01
1716.lowfreq: -7.9949 -0.5684 -0.0003 0.0006 0.0008 9.3904 93.9846 120.9951 121.9130
frequency: 93.9837 120.9940 121.9129 192.7886 271.4344 287.1429 392.5271 403.7167 404.2656 428.7708 453.8790 466.1156 498.2255 530.8065 541.3122 581.1342 596.2837 671.0524 690.2055 730.5913 761.4777 804.6310 827.1876 844.7192 884.6603 951.1698 953.8391 975.0062 992.6191 1021.8476 1033.4089 1100.8149 1158.8033 1173.6925 1190.8409 1237.4107 1276.2374 1326.4630 1369.3796 1409.9070 1425.8023 1440.1438 1480.9911 1522.7533 1573.1157 1610.0145 1631.7856 1646.1226 2144.9532 3122.1793 3123.5632 3131.0484 3146.5199 3147.5491 3165.1969 3540.6958 3687.4483
redmass: 5.4955 9.5818 4.3848 4.0862 4.0880 5.0599 3.2832 4.9532 1.1291 6.6597 3.4177 6.2280 1.2243 6.5253 3.0525 4.2321 5.6020 6.0834 3.5229 6.2156 1.2843 2.8824 1.5757 5.1093 1.7130 3.6921 1.3516 1.4239 1.3445 2.5125 2.3636 1.8083 1.2903 1.1230 1.6816 1.8510 1.7641 2.7630 2.3686 4.9413 3.1708 4.1797 3.0859 3.9975 7.3200 4.6307 4.5802 1.3748 12.6098 1.0869 1.0864 1.0882 1.0951 1.0975 1.1004 1.0464 1.1030
irintensity: 3.9338 4.5819 1.6724 1.8583 5.4803 0.7638 12.3897 0.5205 83.4658 0.0530 20.1711 0.8137 182.8532 1.4269 16.3875 4.5563 0.7412 4.0465 2.2114 1.0080 47.9549 0.3132 89.0521 0.5645 1.0975 7.2580 1.3791 2.6249 0.0155 2.3292 2.6160 8.1273 7.6499 0.0479 11.9079 17.5174 8.3715 39.2820 6.6851 14.8747 0.5965 19.9716 23.6438 66.9929 22.5419 14.6704 36.8170 324.4161 82.7916 1.8139 6.1522 2.4084 10.7822 36.6204 28.9074 101.7942 34.5953
temp: 298.150 k
press: 1.00000 atm
elementType: 7 7 6 6 6 6 6 6 6 6 6 6 6 1 1 1 1 1 1 1 1
symmnumber: 1
zpe: 420554.0 jmol-1
zpe.correction: 0.160181 hartree
zpe.thermalcorrener: 0.170396 hartree
zpe.thermalcorrenthalpy: 0.171340 hartree
zpe.thermalcorrgfe: 0.124711 hartree
zpe.sumelectzpe: -532.607158 hartree
zpe.sumelectthermal: -532.596943 hartree
zpe.sumelectthermalent: -532.595999 hartree
zpe.sumelectthermalfe: -532.642628 hartree
dipole: 0.0111 -4.5600 0.0001
dipole: 4.5600
quadrupole: -59.9141 -74.7197 -80.9700
quadrupole: -13.1301 -0.0001 0.0011
quadrupole: 11.9539 -2.8518 -9.1021 -13.1301 -0.0001 0.0011
hfenergy: -532.767339 hartree
pointgroup: C01 [X(C11H8N2)]
dipole: 0.0832559 1.7920954 0.0000545 debye
dipolederiv: -1.5936128 0.451248 -0.0000179 -0.0081545 -0.1119743 -0.0000115 -0.000006 0.0000004 -0.6798584 -0.3840256 -0.2047883 0.0000248 -0.1873435 -0.5110552 0.0000424 -0.0000166 -0.0000209 -0.2621182 0.5880195 0.1516137 0.0000153 -0.1945301 -0.0796783 -0.0000045 0.0000167 0.0000215 0.0297493 -0.2291313 0.0830856 -0.0000064 0.0031573 -0.3496154 0.0000005 -0.0000045 0.0000054 0.0357145 -0.4535696 -0.1889641 -0.0000154 0.1950578 -0.389877 0.0000007 -0.0000176 -0.0000031 -0.0040673 1.5791964 -0.5007627 0.0000336 0.0560378 0.1496006 0.0000021 0.0000469 0.0000033 0.1452473 0.3427858 -0.2215203 0.000012 -0.1516436 0.2572194 -0.0000072 0.0000135 -0.0000097 -0.1290763 -0.2410888 -0.0267199 -0.0000043 0.1618647 0.1087419 0.0000012 -0.0000035 -0.0000028 -0.1552146 0.2056451 -0.1180125 0.0000099 0.0601849 0.155268 -0.0000016 0.0000094 -0.0000084 -0.1696645 -0.5019761 0.1302441 -0.0000083 -0.3301428 0.1670178 -0.0000111 -0.0000054 -0.0000061 -0.20909 0.0263939 0.0675973 0.0000045 -0.0337323 0.2273335 -0.0000039 0.0000037 -0.0000035 -0.1480403 0.018193 0.0629537 0.0000025 0.1071261 -0.2634869 0.0000021 0.0000034 0.0000026 -0.1770071 0.1315507 0.4018901 -0.0000171 0.3556569 0.5461482 -0.0000279 0.000005 0.0000045 0.0155098 0.0386379 -0.112454 -0.0000016 -0.0477547 -0.0527538 0.0000013 -0.0000004 0.0000015 0.1476424 0.0523586 -0.0910464 0.0000002 -0.0421398 -0.0215788 0.0000002 -0.0000011 -0.0000013 0.1569722 0.0374484 -0.0442372 -0.0000025 -0.1144323 -0.0741216 -0.0000005 -0.0000031 0.0000014 0.155437 -0.0107266 0.1196828 -0.0000059 0.0711128 -0.0564692 0.0000035 -0.0000092 0.000005 0.1674579 0.0204996 0.0928316 -0.0000046 0.1076555 -0.0656492 0.0000052 -0.0000049 0.0000045 0.1574871 -0.1430225 -0.0022494 -0.0000073 -0.0000364 0.0889796 0.0000009 -0.0000064 0.0000011 0.1671944 0.2593917 -0.0360841 -0.0000039 -0.0535136 0.1586539 0.0000029 -0.000008 0.000003 0.3777054 0.2570326 -0.014308 -0.0000076 0.0455701 0.1172968 0.0000051 -0.000012 0.0000016 0.3780196 unknown
polarizability: 199.1243731|-5.1334176|158.2370751|0.0049838|0.0005798|50.9826535 unknown
InChI: InChI=1S/C11H8N2/c12-7-10-9-4-2-1-3-8(9)5-6-11(10)13/h1-6H,13H2
charge 0 multiplicity 1
21 atoms
N  -3.171399 0.919246 -0.000112
N  -2.460277 -2.546614 -0.000223
C  0.38739 -0.326942 -0.000011
C  1.092415 0.934891 -0.00001
C  -1.058808 -0.32168 -0.000045
C  -1.787429 0.902291 -0.000078
C  0.329963 2.152799 -0.000043
C  1.149306 -1.539126 0.00002
C  2.523062 0.94306 0.000024
C  -1.058602 2.14426 -0.000075
C  2.54796 -1.501379 0.000051
C  3.245188 -0.254031 0.000054
C  -1.79807 -1.546022 -0.000042
H  0.866369 3.109077 -0.000044
H  0.623745 -2.500721 0.000016
H  3.046258 1.906819 0.000026
H  -1.618961 3.086461 -0.0001
H  3.116355 -2.437977 0.000074
H  4.340115 -0.241351 0.000078
H  -3.679169 1.799126 -0.000145
H  -3.703214 0.050315 -0.000115
