program: Gaussian 09
title: 000238861
version: EM64L-G09RevD.01
frameworkgroup: C1[X(C13H10N2O)]
method: RPBEPBE
basis: SDD
operation: Freq
keyword: #p
keyword: freq=noraman
keyword: PBEPBE/SDD
title: #p freq=noraman PBEPBE/SDD
converged: YES YES NO YES
title: Mulliken charges:
elementType: O N N C C C C C C C C C C C C C H H H H H H H H H H
charge: -0.245342 -0.442336 -0.029345 0.248039 0.434861 0.090705 0.308455 -0.465978 -0.372165 -0.362950 -0.431960 -0.238898 -0.244689 0.218822 -0.316522 -0.796436 0.245971 0.317482 0.257154 0.248121 0.349659 0.234421 0.234076 0.244701 0.269454 0.244700
chargesum: 0.00000
title: Mulliken charges with hydrogens summed into heavy atoms:
elementType: O N N C C C C C C C C C C C C C
charge: -0.245342 -0.092677 -0.029345 0.248039 0.434861 0.090705 0.308455 -0.220007 -0.054683 -0.105796 -0.183839 -0.004477 -0.010613 0.218822 -0.316522 -0.037581
polarizability: 2.59037426e+02 5.26855798e-01 1.81679312e+02 -1.27316908e-03 3.49370863e-05 6.49259029e+01
1716.lowfreq: -58.7941 -2.6909 -0.0001 0.0006 0.0009 5.6610 12.4494 55.4400 66.5436
frequency: -58.7757 55.4316 66.5416 104.0625 112.0810 143.3919 155.0884 200.1173 261.6029 290.5240 305.0080 390.7725 397.3146 445.2925 454.6367 478.8683 529.1375 531.8102 568.3874 579.4579 586.0393 640.1489 684.8242 697.0547 720.8990 765.7902 766.4100 806.6130 842.7985 859.2515 880.8220 896.5199 966.7856 966.8561 996.2831 1005.4005 1011.7039 1032.6866 1034.6580 1058.1368 1151.1357 1176.2115 1190.3223 1221.8328 1241.4257 1276.3244 1306.6140 1354.1599 1380.4113 1384.2136 1412.8467 1434.0541 1444.4789 1458.3335 1466.6511 1503.9022 1525.3135 1580.9969 1600.2217 1630.1785 1643.9950 2146.2482 2992.0258 3076.9020 3128.2985 3134.8471 3137.6901 3141.7020 3149.7910 3167.4504 3197.1567 3473.4762
redmass: 1.0388 5.1880 5.1392 5.1749 8.1548 5.6115 4.2878 4.4123 7.7682 4.1649 5.3729 5.8048 3.7525 8.5264 3.6441 4.6767 6.2818 3.3618 6.5902 3.0971 4.1549 6.3212 2.1891 6.3083 1.5715 5.2728 1.2748 3.1083 5.4285 1.4183 4.6934 1.7342 1.3733 3.0160 1.3366 2.6353 1.3471 2.2165 1.6666 3.2208 1.4227 1.1100 1.5026 2.9325 1.7881 1.7479 2.7771 3.0756 1.2776 3.9109 3.1817 4.4715 1.3776 1.5954 1.0457 2.5947 3.3132 4.9239 5.8459 6.5785 4.6483 12.6190 1.0385 1.0981 1.0862 1.0892 1.0907 1.0983 1.0952 1.1006 1.0948 1.0767
irintensity: 0.4528 0.0059 14.0524 1.1123 9.5094 1.3151 0.4045 1.0990 3.1712 0.0403 0.0466 1.0018 0.3194 0.0866 15.0448 10.8269 0.0044 1.4154 10.3690 0.3448 4.5658 0.2013 44.5280 4.1385 45.7797 1.4632 51.8107 1.8439 0.6780 57.5366 0.3382 16.9676 5.8901 30.1055 0.0187 17.8584 0.8650 2.0976 9.3199 1.5708 2.5399 0.7066 26.9846 86.3629 13.7481 24.8051 213.2606 63.3911 32.2779 123.0497 60.0228 16.2408 37.5063 14.8108 20.7241 387.0555 12.2444 120.9803 92.1674 43.5373 119.2557 64.7770 4.0723 10.9278 1.1437 0.8881 10.1404 7.7935 20.6221 29.3923 14.5903 20.4433
temp: 298.150 k
press: 1.00000 atm
elementType: 8 7 7 6 6 6 6 6 6 6 6 6 6 6 6 6 1 1 1 1 1 1 1 1 1 1
symmnumber: 1
zpe: 516896.9 jmol-1
zpe.correction: 0.196876 hartree
zpe.thermalcorrener: 0.209705 hartree
zpe.thermalcorrenthalpy: 0.210649 hartree
zpe.thermalcorrgfe: 0.157134 hartree
zpe.sumelectzpe: -685.035636 hartree
zpe.sumelectthermal: -685.022806 hartree
zpe.sumelectthermalent: -685.021862 hartree
zpe.sumelectthermalfe: -685.075377 hartree
dipole: -1.1892 -0.7636 0.0001
dipole: 1.4132
quadrupole: -75.3177 -101.9989 -96.4187
quadrupole: 10.5412 -0.0001 0.0008
quadrupole: 15.9274 -10.7538 -5.1736 10.5412 -0.0001 0.0008
hfenergy: -685.2325116 hartree
pointgroup: C01 [X(C13H10N2O1)]
dipole: 0.4624325 0.3086847 0.0002682 debye
dipolederiv: -0.8190982 0.0149293 0.0001435 0.6473629 -0.9467823 -0.0008447 0.0008511 -0.0006847 -0.3291598 -2.3445396 0.36754 0.000923 0.118506 -0.3460257 -0.000089 0.0006814 -0.0001557 -0.3004572 -0.2670917 -0.1053292 -0.0001046 -0.0682926 -0.5530833 -0.0002943 -0.0000735 -0.0003172 -0.2454256 0.3305967 0.2122157 0.0001592 -0.0903113 -0.0784567 -0.0000864 -0.0001703 -0.000148 0.0189812 -0.1597967 0.0427672 0.0000983 0.1257428 -0.2361964 -0.0003417 0.0001858 -0.0003219 0.0522969 -0.2563411 -0.0722616 -0.0000099 0.0889246 -0.3680564 -0.000452 0.0001705 -0.000406 0.0268827 1.3467822 -0.1611733 -0.0004777 0.7378312 0.2187561 -0.0000688 0.0004912 0.0001604 0.1089149 0.3618447 0.0060991 -0.0001093 -0.0739808 0.1867788 0.0003651 -0.0001964 0.0003506 -0.1377903 -0.45886 -0.1172197 -0.0000534 -0.4145489 -0.1115341 0.0001529 -0.0003844 0.0000815 -0.1611328 -0.1786327 -0.0717109 -0.000071 -0.009554 0.0999924 0.0002671 -0.0000033 0.0002789 -0.1460509 0.1124648 -0.0347868 -0.0001009 0.1042529 0.1401288 0.0003075 0.000053 0.0003402 -0.1658739 -0.0005762 -0.0569328 -0.0000925 -0.1369619 0.1662783 0.0003695 -0.0001815 0.0003491 -0.1457425 -0.016103 0.1277828 0.0001074 0.1717 -0.1026554 0.0000222 0.0001524 0.0000343 -0.1604883 2.251348 -0.2382947 -0.0008152 -0.9541696 1.2127261 0.0013866 -0.0016208 0.0012073 0.1747245 -0.0522567 0.1848441 0.0002163 0.0811694 0.6635568 0.0006681 0.0001088 0.0006532 0.0177677 -0.3797613 -0.144217 -0.0000426 -0.3224453 -0.1564742 -0.000131 -0.0002364 -0.0001756 0.0429584 0.0648302 -0.0640391 -0.0000503 -0.0182271 -0.0722661 -0.00023 0.0000002 -0.0002204 0.1460693 0.166733 0.0656365 0.0000705 0.0093999 0.0948158 -0.0000936 0.0000117 -0.0001104 0.1797688 0.0888575 -0.0587212 -0.0000473 -0.0054593 -0.0469132 -0.0002178 0.0000105 -0.0002047 0.1563858 0.0728633 0.0087164 0.0000277 -0.0687922 -0.0945765 -0.000256 -0.0000575 -0.0002749 0.1562803 0.1956132 -0.001758 0.0000228 -0.0348989 0.1281046 -0.0001714 -0.0000193 -0.0001775 0.29429 -0.0455932 0.0949365 0.0001483 0.1101039 0.0053107 -0.0001898 0.0001644 -0.0001865 0.1582162 -0.1147944 -0.069454 -0.0000125 -0.0666705 0.0695483 -0.0000876 -0.000009 -0.000087 0.1644918 0.0655875 0.0120792 0.0459672 -0.021933 0.0404679 -0.0943416 0.0004486 -0.09928 -0.0200127 -0.0296378 0.0461143 0.0000956 0.1131287 0.0465122 -0.0001276 0.0001695 -0.0001092 0.1336704 0.0655615 0.0122372 -0.0459925 -0.0218772 0.0400435 0.0944842 -0.0005465 0.0994043 -0.0195648 unknown
polarizability: 258.9942201|1.9019459|181.722369|-0.0436835|0.1272412|64.9260523 unknown
InChI: InChI=1S/C13H10N2O/c1-9(16)15-13-7-6-10-4-2-3-5-11(10)12(13)8-14/h2-7,15H,1H3
charge 0 multiplicity 1
26 atoms
O  -3.664029 1.67885 0.002814
N  -2.371914 -0.290483 0.000284
N  -0.588423 -3.287061 -0.00348
C  1.397532 -0.284896 -0.000595
C  1.667425 1.135147 0.000876
C  0.022648 -0.726799 -0.000752
C  -1.050207 0.208483 0.000504
C  0.562338 2.048061 0.002107
C  -0.760435 1.613554 0.001942
C  2.498706 -1.200061 -0.001829
C  3.024968 1.590622 0.001066
C  3.813688 -0.725735 -0.001611
C  4.082862 0.678687 -0.000154
C  -3.587264 0.418545 0.001403
C  -0.285322 -2.126642 -0.0022
C  -4.813496 -0.490778 0.000751
H  0.770021 3.124471 0.003218
H  -1.594865 2.315914 0.002896
H  2.301484 -2.277842 -0.002944
H  3.219922 2.66924 0.002192
H  -2.455248 -1.313512 -0.00081
H  4.647976 -1.435409 -0.002563
H  5.118907 1.032973 -0.000003
H  -4.829212 -1.139935 -0.894105
H  -5.715964 0.136092 0.001695
H  -4.828698 -1.141887 0.894197
