program: Gaussian 09
title: 000238869
version: EM64L-G09RevD.01
frameworkgroup: C1[X(C10H17N3O4)]
method: RPBEPBE
basis: SDD
operation: Freq
keyword: #p
keyword: freq=noraman
keyword: PBEPBE/SDD
title: #p freq=noraman PBEPBE/SDD
converged: YES YES NO NO
title: Mulliken charges:
elementType: O O O O N N N C C C C C C C C C C H H H H H H H H H H H H H H H H H
charge: -0.260314 -0.462123 -0.321940 -0.447709 -0.178920 -0.222128 -0.353476 0.325042 -0.340836 -0.380228 0.162430 -0.387392 -0.303140 0.213185 -0.366352 -0.685202 -0.304204 0.213742 0.218075 0.238732 0.284072 0.249133 0.259552 0.274678 0.217309 0.202564 0.346687 0.211551 0.241136 0.220416 0.191628 0.219734 0.352336 0.371960
chargesum: 0.00000
title: Mulliken charges with hydrogens summed into heavy atoms:
elementType: O O O O N N N C C C C C C C C C C
charge: -0.260314 -0.109787 -0.321940 -0.075749 -0.178920 -0.222128 -0.006789 0.325042 0.090981 0.142575 0.162430 0.121293 -0.028462 0.213185 0.053522 -0.012099 0.107159
polarizability: 2.08729935e+02 1.21633547e+01 1.43714397e+02 5.27844274e+00 5.17106368e+00 9.86489776e+01
1716.lowfreq: -10.2600 -2.2052 0.0004 0.0004 0.0007 8.8300 30.3449 46.2597 58.7590
frequency: 30.1701 46.2240 58.6948 66.7792 77.4548 107.9936 131.0347 137.8388 171.5580 179.7100 205.4587 210.2887 246.5637 267.7007 291.5702 319.6657 322.6603 339.8408 384.3006 405.5445 414.2478 443.7772 462.9620 507.7463 518.5139 541.0374 621.5492 632.0448 637.7813 667.5363 717.6422 727.1108 749.6831 783.3883 790.6796 800.0335 847.8903 887.0598 912.3127 938.8701 958.2269 1001.6279 1030.1480 1045.5671 1060.2959 1060.9752 1071.0097 1087.0019 1129.7807 1138.0719 1173.1510 1196.7633 1197.6967 1208.9248 1227.0133 1266.7223 1298.4168 1302.3925 1339.5214 1342.4332 1349.9556 1355.1081 1369.1849 1378.2238 1381.9574 1406.0825 1409.9886 1424.3557 1434.4193 1449.1751 1458.5488 1469.2842 1469.4080 1476.3821 1478.2976 1488.3856 1579.0301 1619.0978 1642.3708 2906.0054 2941.5152 2951.1206 2980.3285 3009.8884 3013.5435 3028.4558 3048.3234 3059.1180 3074.6944 3082.9778 3107.6513 3117.8333 3199.7032 3359.7564 3565.0033 3571.5775
redmass: 5.5428 3.8377 3.8977 4.8766 3.4082 5.2038 3.1170 5.1032 2.9938 4.7146 1.3851 2.7942 3.3267 1.3009 2.2043 4.8519 3.5292 4.2504 3.3074 3.5655 4.4903 2.5854 3.4633 4.4779 4.1821 3.1795 1.7269 2.0168 3.9719 1.1951 5.0911 4.6627 8.6618 1.6322 1.4114 2.2551 2.6957 2.9980 2.0942 2.1167 3.1263 2.6805 3.1523 2.1606 2.6690 2.3026 2.0343 2.9140 2.4136 3.0620 2.4447 1.2724 1.4830 1.2478 1.3232 1.7524 1.2161 1.3784 1.4338 1.5008 1.4370 1.5282 1.3409 1.2661 1.4857 1.9364 1.5118 1.6255 1.2647 1.5243 1.0899 1.0877 1.0610 1.0773 1.0612 1.0986 6.9205 5.6183 5.8430 1.0681 1.0699 1.0570 1.0353 1.1039 1.0925 1.0614 1.0638 1.0940 1.0965 1.0992 1.1011 1.1045 1.0930 1.0663 1.0782 1.0665
irintensity: 1.3121 1.1534 1.5843 1.5789 1.7514 8.0274 7.1331 2.2417 6.4367 5.9642 2.8966 1.7932 7.7203 103.7281 39.5445 13.1619 12.5990 0.3915 4.8185 7.2667 46.4008 6.3963 4.1562 7.8927 10.6689 0.1986 64.5518 8.7538 6.2365 123.7931 70.7200 6.7932 18.1924 33.3108 37.1227 5.4324 3.5963 30.2568 0.3218 74.1005 13.7487 6.8055 136.1511 19.5800 18.5759 40.7562 43.4814 39.4184 13.1127 18.5400 12.2108 44.2940 34.9676 49.5051 29.6361 111.1296 38.4271 19.0032 69.0898 3.6260 2.2848 12.2418 4.2872 35.7249 44.4269 69.3845 1.8570 121.6547 69.7256 45.9838 22.9181 2.1948 9.6699 13.1740 13.8993 47.1395 443.7810 120.1768 333.9111 50.7027 59.8905 54.9038 23.2703 45.4354 43.8510 13.9081 17.2004 51.5936 53.2960 24.0768 6.5740 9.0899 12.1285 231.0155 85.8749 5.4072
temp: 298.150 k
press: 1.00000 atm
elementType: 8 8 8 8 7 7 7 6 6 6 6 6 6 6 6 6 6 1 1 1 1 1 1 1 1 1 1 1 1 1 1 1 1 1
symmnumber: 1
zpe: 726105.8 jmol-1
zpe.correction: 0.276559 hartree
zpe.thermalcorrener: 0.294362 hartree
zpe.thermalcorrenthalpy: 0.295306 hartree
zpe.thermalcorrgfe: 0.230279 hartree
zpe.sumelectzpe: -855.080770 hartree
zpe.sumelectthermal: -855.062967 hartree
zpe.sumelectthermalent: -855.062023 hartree
zpe.sumelectthermalfe: -855.127050 hartree
dipole: -7.7463 2.9701 -0.4421
dipole: 8.3080
quadrupole: -119.7042 -94.3296 -100.1188
quadrupole: -3.9152 13.3621 -1.7898
quadrupole: -14.9866 10.3879 4.5987 -3.9152 13.3621 -1.7898
hfenergy: -855.3573289 hartree
pointgroup: C01 [X(C10H17N3O4)]
dipole: -3.0193005 -0.5975845 1.1002405 debye
polarizability: 207.6322133|-17.0951228|128.7484884|-1.5916441|-21.4812439|114.7126072 unknown
InChI: InChI=1S/C10H17N3O4/c1-2-12(3-5-14)8-7-11-10(17)13(4-6-15)9(8)16/h7,11,14-15H,2-6H2,1H3
charge 0 multiplicity 1
34 atoms
O  0.322577 1.622177 -1.082981
O  -5.07645 0.511581 0.642562
O  3.323242 -1.611111 0.534614
O  5.088923 0.446643 0.087113
N  -1.905978 0.342961 0.255025
N  1.793301 -0.053366 -0.372062
N  1.059716 -1.790752 1.034934
C  -0.606618 -0.203278 0.246969
C  -2.826364 -0.158816 1.298064
C  -2.514449 0.778591 -1.041437
C  0.481778 0.537642 -0.448027
C  2.895264 0.616326 -1.129302
C  -0.265832 -1.356983 0.940867
C  2.131984 -1.177716 0.401035
C  -3.99564 0.782923 1.608031
C  -3.008006 -0.397796 -1.913413
C  3.962927 1.31001 -0.243786
H  -2.232554 -0.27169 2.22634
H  -3.258733 -1.15833 1.056427
H  -3.366938 1.434771 -0.804884
H  -1.760204 1.378145 -1.572678
H  2.39068 1.35682 -1.769066
H  3.395357 -0.141713 -1.758903
H  -1.000515 -1.982459 1.447897
H  -3.652502 1.837041 1.555861
H  -4.347738 0.571174 2.639663
H  1.302525 -2.604293 1.602343
H  -2.184756 -1.096933 -2.15095
H  -3.820938 -0.952603 -1.413138
H  -3.406243 -0.008525 -2.868699
H  3.471675 1.723139 0.665188
H  4.396081 2.153345 -0.809118
H  -5.843746 1.110521 0.823209
H  4.706275 -0.439848 0.354504
