program: Gaussian 09
title: 000239145
version: EM64L-G09RevD.01
frameworkgroup: C1[X(C24H28N2O2)]
method: RPBEPBE
basis: SDD
operation: Freq
keyword: #p
keyword: freq=noraman
keyword: PBEPBE/SDD
title: #p freq=noraman PBEPBE/SDD
converged: YES YES NO NO
title: Mulliken charges:
elementType: O O N N C C C C C C C C C C C C C C C C C C C C C C C C H H H H H H H H H H H H H H H H H H H H H H H H H H H H
charge: -0.219425 -0.215286 -0.042233 -0.037417 -0.562332 -0.574113 -0.715683 -0.691193 0.169441 0.192241 0.241887 0.226173 -0.440221 -0.480347 0.511849 0.527412 -0.794951 -0.781600 -0.376838 -0.454230 -0.427405 -0.370884 -0.239848 -0.223179 -0.227381 -0.211423 -0.245873 -0.257416 0.229058 0.242611 0.239373 0.237426 0.247160 0.293111 0.240705 0.284263 0.219882 0.229009 0.218269 0.191907 0.235418 0.292564 0.244736 0.229541 0.256137 0.255426 0.222092 0.225003 0.287968 0.224523 0.219337 0.221487 0.223822 0.259928 0.222454 0.227063
chargesum: 0.00000
title: Mulliken charges with hydrogens summed into heavy atoms:
elementType: O O N N C C C C C C C C C C C C C C C C C C C C C C C C
charge: -0.219425 -0.215286 -0.042233 -0.037417 -0.090663 -0.097314 -0.175412 -0.166225 0.169441 0.192241 0.241887 0.226173 0.008669 -0.070170 0.511849 0.527412 -0.022233 -0.040496 -0.154747 -0.229227 -0.139436 -0.146361 -0.020511 -0.001692 -0.003559 0.048505 -0.023419 -0.030353
polarizability: 3.23459755e+02 -8.42738974e+00 2.68375292e+02 -1.59287538e+01 -1.30893217e+01 2.15975111e+02
1716.lowfreq: -4.4956 -0.0010 -0.0008 0.0004 3.2870 5.7035 14.0360 16.1338 26.5794
frequency: 13.7849 15.8308 26.5010 30.9009 37.5449 46.0239 49.0022 54.5583 68.8001 70.2056 75.6326 80.9272 93.5982 104.5800 118.6852 130.0831 146.3323 168.4902 176.2525 237.4538 242.0253 249.3306 263.7268 266.9422 297.9171 321.0595 330.2162 343.0840 377.8623 395.4560 404.5050 405.5784 450.5284 458.2006 466.0491 471.3758 478.8629 491.0277 511.3890 526.3191 544.7340 598.6417 606.0822 617.1934 617.4238 649.3583 671.6182 704.6022 706.0028 736.3566 744.5603 754.2304 774.0715 815.5481 816.9201 825.6588 836.1562 854.7554 855.7916 861.5701 874.6376 895.9393 911.3730 922.6556 933.5572 941.9616 948.0535 967.8823 976.2048 978.9870 988.7705 990.7566 992.5971 999.5901 1000.7264 1019.7598 1022.5149 1029.0908 1029.4932 1032.7097 1039.7017 1067.8394 1082.9512 1083.1844 1093.3634 1115.7084 1154.0291 1162.5734 1171.3936 1172.8617 1177.0488 1192.8287 1194.0427 1196.9948 1204.7929 1218.2440 1220.3659 1237.8451 1239.7767 1248.7905 1258.4295 1273.6956 1307.3900 1313.8382 1331.9433 1332.8135 1340.2056 1347.8218 1379.4893 1382.7955 1383.4580 1387.2079 1422.3961 1423.9715 1434.5806 1439.0642 1440.2429 1443.2345 1445.4266 1451.1407 1457.0162 1459.0787 1475.2374 1487.8497 1489.1428 1493.1122 1594.1525 1594.6645 1612.6035 1616.1737 1619.9693 1622.6943 1644.0939 1650.5055 2942.0937 2942.6104 2952.8676 2961.6970 2974.9968 2978.1213 2996.4107 3000.9041 3002.0302 3004.7984 3033.4423 3038.5676 3056.3953 3057.3440 3093.8039 3102.5743 3110.1718 3112.0519 3113.9638 3120.7335 3123.0008 3126.4982 3131.5853 3134.9181 3145.0368 3147.5191 3159.4810 3164.6166
redmass: 4.7857 4.3567 5.1915 3.7656 4.5926 4.5332 4.7435 5.8609 4.0947 3.5967 4.9940 3.7636 4.5272 4.0618 1.2828 1.1400 3.4724 3.7036 3.4983 4.1700 4.1463 4.2750 4.0685 4.7510 3.2372 2.2497 2.2333 2.2178 2.5726 2.2075 2.8226 2.8384 3.3619 2.9607 3.0057 3.2980 3.6465 3.1442 3.4804 3.5268 2.7922 3.3102 3.4633 6.3277 6.3183 3.8610 3.2767 1.8600 1.9809 1.7565 1.9714 3.4419 3.2847 3.0061 3.2302 3.6400 3.4328 1.2543 1.2677 2.4309 2.7142 1.9823 1.8170 1.7201 1.6856 1.8028 1.9432 1.9051 1.3789 1.3648 3.6701 5.3308 2.4100 1.3709 1.3693 1.9478 2.1332 2.0975 2.1782 1.9143 2.0957 2.0690 1.6097 1.6772 2.6200 2.8894 1.1859 1.7447 1.0564 1.1154 1.1209 1.3217 1.1438 1.2260 1.2073 1.9795 2.0866 1.8002 2.5182 1.5497 1.1853 1.3640 1.8341 1.7573 1.3305 1.3241 1.2931 1.3045 1.2263 7.8991 7.8855 1.2390 1.0859 1.1708 1.2541 1.0969 1.2075 1.6949 1.7156 1.1140 1.0598 1.0825 1.0738 2.3665 2.3206 1.0725 6.0962 6.0740 6.8440 6.5537 6.8865 6.9827 7.4888 7.8247 1.0645 1.0573 1.0620 1.0639 1.0382 1.0395 1.0625 1.0952 1.0923 1.1012 1.0573 1.0981 1.0962 1.0949 1.0991 1.0998 1.1067 1.0872 1.0853 1.0881 1.0876 1.0973 1.0905 1.0924 1.0966 1.0954 1.1017 1.1009
irintensity: 0.2316 0.5551 1.2729 0.7335 1.2810 0.0425 0.6135 5.8966 1.8037 2.4786 4.8628 1.9306 0.3429 3.4757 1.0789 1.3925 5.4254 4.1380 3.1314 2.8169 8.4312 1.6678 2.6257 0.6884 3.1500 3.7807 3.9832 3.4031 0.5616 1.8730 0.0393 0.1906 2.1958 1.1408 10.6798 6.3332 4.4475 1.0627 17.6921 15.7027 9.1065 6.8118 9.1127 1.0914 1.0345 7.5637 10.4238 87.7701 2.1302 61.2867 18.3637 7.1587 2.2513 5.5920 9.3602 3.4854 2.6552 0.1786 0.2498 2.7215 0.9908 1.3785 0.3485 3.0342 2.3000 1.1638 5.5743 2.8472 0.5804 0.6956 5.2754 1.2822 8.5284 0.5442 0.4633 6.7106 3.0160 7.1804 6.1527 2.5290 29.9334 1.9117 8.6623 7.7194 67.9937 81.1246 3.7915 60.5585 0.5352 5.4972 11.1622 21.3313 2.2120 6.6466 12.7755 3.6512 4.8139 6.4298 62.0595 76.1134 9.8484 32.3741 48.8241 57.9965 11.5653 9.0782 3.4147 7.3331 41.1248 2.1638 0.7479 79.5081 14.9406 29.1613 23.6705 13.4408 9.9930 32.3999 14.0916 21.0492 7.7275 20.5202 23.0801 15.6732 21.8715 2.3047 4.5165 0.2550 76.6027 59.2536 60.6848 128.4912 66.1140 29.4343 5.3180 40.9472 26.3803 64.0311 14.3119 17.7899 11.4447 2.8446 9.9336 62.4805 16.5703 35.7311 14.1128 9.2598 9.9255 9.4060 9.1114 8.2640 4.0210 16.2170 9.5764 10.7260 13.7568 27.7280 14.9819 31.8310 36.7574 12.4052
temp: 298.150 k
press: 1.00000 atm
elementType: 8 8 7 7 6 6 6 6 6 6 6 6 6 6 6 6 6 6 6 6 6 6 6 6 6 6 6 6 1 1 1 1 1 1 1 1 1 1 1 1 1 1 1 1 1 1 1 1 1 1 1 1 1 1 1 1
symmnumber: 1
zpe: 1207649.3 jmol-1
zpe.correction: 0.459969 hartree
zpe.thermalcorrener: 0.488357 hartree
zpe.thermalcorrenthalpy: 0.489302 hartree
zpe.thermalcorrgfe: 0.396515 hartree
zpe.sumelectzpe: -1189.220628 hartree
zpe.sumelectthermal: -1189.192240 hartree
zpe.sumelectthermalent: -1189.191296 hartree
zpe.sumelectthermalfe: -1189.284082 hartree
dipole: 3.8346 -1.2959 -0.2708
dipole: 4.0567
quadrupole: -157.2177 -147.6383 -167.2683
quadrupole: -5.4713 -2.3838 -2.1701
quadrupole: 0.1570 9.7365 -9.8936 -5.4713 -2.3838 -2.1701
hfenergy: -1189.6805974 hartree
pointgroup: C01 [X(C24H28N2O2)]
dipole: -0.0662046 -1.5945393 -0.0188935 debye
polarizability: 274.3384355|13.7758085|322.86084|-5.0841405|0.1143233|210.6108824 unknown
InChI: InChI=1S/C24H28N2O2/c1-19(15-23(27)17-21-9-5-3-6-10-21)25-13-14-26-20(2)16-24(28)18-22-11-7-4-8-12-22/h3-12H,13-18H2,1-2H3
charge 0 multiplicity 1
56 atoms
O  2.893768 0.442178 -0.663567
O  -1.86262 -0.082931 1.511608
N  0.886276 -3.143917 -0.461547
N  -2.09565 -3.614739 -0.300814
C  2.734455 -1.793422 0.314557
C  -3.198423 -2.104603 1.233908
C  1.852233 0.308041 1.569034
C  -2.935075 -0.409179 -0.695233
C  1.953775 -2.478351 -0.811703
C  -2.148095 -3.193701 0.932472
C  2.530369 -0.258693 0.31668
C  -2.607174 -0.765293 0.758935
C  0.06934 -3.858869 -1.473194
C  -1.093035 -4.592332 -0.763962
C  1.75406 1.819634 1.661432
C  -2.16054 0.746655 -1.295877
C  2.516355 -2.300872 -2.212736
C  -1.273204 -3.576664 2.115275
C  2.925521 2.61577 1.737853
C  -2.822274 1.919644 -1.735183
C  0.487456 2.453834 1.696363
C  -0.750743 0.669924 -1.433615
C  2.835255 4.019742 1.854547
C  -2.093434 2.990858 -2.302528
C  0.396454 3.859952 1.813889
C  -0.015932 1.740158 -1.986903
C  1.567451 4.64715 1.895408
C  -0.688248 2.904124 -2.427673
H  3.817972 -1.977622 0.174399
H  2.411265 -2.225174 1.274931
H  -3.399518 -2.051266 2.316357
H  -4.123654 -2.334408 0.68084
H  2.402852 -0.110221 2.43919
H  0.843685 -0.154077 1.61802
H  -4.027687 -0.219907 -0.73687
H  -2.782564 -1.353808 -1.262692
H  0.678135 -4.603169 -2.029109
H  -0.357885 -3.157167 -2.22061
H  -1.592021 -5.248465 -1.501703
H  -0.665556 -5.22976 0.037852
H  3.435397 -2.909186 -2.328257
H  2.810395 -1.245752 -2.359283
H  1.805235 -2.597094 -3.000751
H  -1.865761 -4.144793 2.859048
H  -0.925506 -2.652842 2.6145
H  -0.388087 -4.157156 1.81895
H  3.911764 2.136681 1.698714
H  -3.912257 1.997187 -1.632562
H  -0.422235 1.846974 1.621726
H  -0.226267 -0.231327 -1.091807
H  3.748455 4.623375 1.912434
H  -2.620652 3.890825 -2.639733
H  -0.589584 4.337787 1.836775
H  1.075658 1.67353 -2.046801
H  1.495354 5.737185 1.98697
H  -0.119355 3.738556 -2.852753
