program: Gaussian 09
title: 000238868
version: EM64L-G09RevD.01
frameworkgroup: C1[X(C10H15N3O5)]
method: RPBEPBE
basis: SDD
operation: Freq
keyword: #p
keyword: freq=noraman
keyword: PBEPBE/SDD
title: #p freq=noraman PBEPBE/SDD
converged: YES YES NO NO
title: Mulliken charges:
elementType: O O O O O N N N C C C C C C C C C C H H H H H H H H H H H H H H H
charge: -0.440172 -0.436030 -0.237212 -0.266515 -0.226167 -0.125291 -0.408580 -0.343399 -0.475536 -0.353930 -0.389706 0.180586 -0.337507 -0.326826 0.134386 0.154559 -0.213167 0.159480 0.256119 0.229593 0.204281 0.217663 0.189860 0.269707 0.218770 0.229109 0.226726 0.199048 0.310790 0.369087 0.359801 0.336999 0.333474
chargesum: 0.00000
title: Mulliken charges with hydrogens summed into heavy atoms:
elementType: O O O O O N N N C C C C C C C C C C
charge: -0.103172 -0.102556 -0.237212 -0.266515 -0.226167 -0.125291 -0.039493 0.016402 0.010176 0.068014 0.069861 0.180586 0.110373 0.098948 0.134386 0.154559 0.097624 0.159480
polarizability: 2.04265152e+02 2.81497057e+00 1.53305600e+02 -3.00164262e+01 -2.77678037e+00 1.15032986e+02
1716.lowfreq: -5.9576 -4.0252 -0.0010 -0.0004 0.0002 8.1831 16.3964 27.8184 41.0697
frequency: 16.0725 27.7960 41.0312 56.3655 69.3854 84.8051 97.6214 108.6626 131.0294 148.5009 165.8624 202.8798 227.1351 270.5253 293.8838 300.1448 310.5125 331.2256 340.7124 353.1125 380.6633 415.3324 421.2343 454.2941 490.7905 527.5563 531.2582 608.2034 657.4553 666.2290 695.7531 717.9649 755.9174 764.0308 786.2694 793.3012 804.0522 843.3033 939.2988 951.4002 961.1435 961.3689 967.6022 1019.7727 1035.7933 1046.2456 1057.6508 1060.1735 1107.1644 1116.8879 1148.8917 1172.3113 1177.9298 1233.0144 1258.1771 1287.0497 1298.2065 1300.4152 1308.4740 1311.5307 1326.1809 1343.9064 1355.1317 1360.4696 1364.9442 1379.8326 1382.4708 1392.5718 1439.9842 1454.5494 1456.2170 1469.2284 1477.4174 1484.2679 1543.0521 1595.7899 1642.0570 1688.9523 2849.2351 2941.7993 2948.0669 2967.8888 3009.4453 3015.5918 3051.5065 3088.6536 3093.0324 3098.2208 3163.0953 3520.2219 3549.3905 3559.2853 3566.6350
redmass: 6.2355 7.2837 4.5043 4.6840 4.5601 3.1813 4.6338 3.0669 2.9351 4.4323 8.1012 5.1364 3.1040 6.9307 2.1127 2.1632 1.2725 2.5720 3.0415 11.2529 5.3191 3.4859 3.2229 3.4179 4.4577 7.8775 4.2290 5.3673 5.0716 1.6539 2.8676 2.3895 8.2036 2.4886 1.1472 2.5696 1.2549 4.7471 2.9760 3.5691 3.8160 1.7983 2.3612 2.9080 3.1663 2.2644 2.5184 2.2235 1.8655 2.0980 1.8548 1.9478 1.6324 1.7549 1.8590 1.2337 2.2042 1.3901 1.4579 1.2656 1.3699 1.2879 1.3048 1.7188 1.5674 2.1691 1.3088 1.3591 1.0972 2.3570 1.0864 1.0817 1.0867 1.0871 8.0876 6.1553 7.1720 5.7387 1.0707 1.0630 1.0648 1.0680 1.0857 1.0765 1.0873 1.0936 1.0979 1.1045 1.0942 1.0771 1.0788 1.0662 1.0663
irintensity: 0.7191 2.3473 2.6973 0.8271 1.3824 8.3022 3.8342 6.7197 1.4970 3.3874 4.8317 10.1223 6.8478 3.0125 42.8515 64.0341 102.8681 62.6114 16.3599 19.4153 25.3172 22.6617 23.4154 11.8664 3.1053 17.7691 17.8154 17.7682 1.9898 51.2062 30.2153 17.8030 0.0912 62.1484 21.5285 122.4533 3.8961 19.5346 6.8203 119.8082 75.6513 19.0677 41.6745 50.5634 16.7863 6.1180 10.0357 39.4613 4.0150 30.0063 15.7985 60.5237 74.6125 22.8902 6.4486 8.5371 90.1885 12.1810 29.5099 9.5252 11.2295 28.2052 35.8665 29.3683 41.5200 100.7791 14.9796 23.0496 25.9468 36.8407 16.4300 4.8171 10.1679 7.4628 175.4871 6.0170 414.3929 790.7001 142.2871 33.6057 114.7668 59.4966 29.3314 35.0476 5.6098 0.6453 26.7841 32.1236 2.0521 59.2954 116.0806 7.7929 8.3823
temp: 298.150 k
press: 1.00000 atm
elementType: 8 8 8 8 8 7 7 7 6 6 6 6 6 6 6 6 6 6 1 1 1 1 1 1 1 1 1 1 1 1 1 1 1
symmnumber: 1
zpe: 677029.3 jmol-1
zpe.correction: 0.257867 hartree
zpe.thermalcorrener: 0.276633 hartree
zpe.thermalcorrenthalpy: 0.277577 hartree
zpe.thermalcorrgfe: 0.208394 hartree
zpe.sumelectzpe: -929.042077 hartree
zpe.sumelectthermal: -929.023311 hartree
zpe.sumelectthermalent: -929.022367 hartree
zpe.sumelectthermalfe: -929.091550 hartree
dipole: -0.8669 -0.6268 -1.7783
dipole: 2.0753
quadrupole: -105.4923 -115.0711 -113.7538
quadrupole: 8.0051 -6.5325 -7.7429
quadrupole: 5.9468 -3.6320 -2.3147 8.0051 -6.5325 -7.7429
hfenergy: -929.299944 hartree
pointgroup: C01 [X(C10H15N3O5)]
dipole: -0.5185822 0.4106131 0.4786647 debye
polarizability: 187.6295108|24.8393123|153.7506467|38.2550938|-5.8342924|131.2235808 unknown
InChI: InChI=1S/C10H15N3O5/c14-3-1-13(2-4-15)6-8(16)7-5-11-10(18)12-9(7)17/h5,11-12,14-15H,1-4,6H2
charge 0 multiplicity 1
33 atoms
O  3.377123 -2.971048 1.430088
O  3.881079 1.802488 -2.110087
O  -0.545082 2.50071 0.099837
O  -0.687351 -1.501592 1.837398
O  -3.91471 -2.624873 -1.344047
N  1.85693 0.478064 0.827966
N  -2.265611 -2.003916 0.217603
N  -2.976675 -0.474364 -1.40991
C  0.755887 1.096328 1.600643
C  2.634056 -0.596318 1.488708
C  2.631581 1.428487 0.003766
C  -0.38764 1.347833 0.611978
C  2.502523 -1.971394 0.791916
C  3.224092 0.789601 -1.269722
C  -1.261534 0.214426 0.165946
C  -1.331766 -1.104123 0.82287
C  -2.100391 0.460777 -0.910885
C  -3.112753 -1.780718 -0.875036
H  0.433092 0.394731 2.385018
H  1.037906 2.071395 2.053521
H  2.299237 -0.702337 2.539975
H  3.712009 -0.327396 1.519971
H  3.460195 1.891178 0.600187
H  1.965892 2.25054 -0.314094
H  2.857552 -1.917315 -0.249611
H  1.444793 -2.295084 0.798859
H  2.41607 0.379841 -1.896509
H  3.93138 -0.028893 -1.020496
H  -2.07182 1.444105 -1.390935
H  -2.335231 -2.930032 0.653013
H  -3.578407 -0.26658 -2.210365
H  3.011639 -3.193492 2.323113
H  4.650632 2.183269 -1.615677
