program: Gaussian 09
title: 000238908
version: EM64L-G09RevD.01
frameworkgroup: C1[X(C14H20BrN2O2P)]
method: RPBEPBE
basis: SDD
operation: Freq
keyword: #p
keyword: freq=noraman
keyword: PBEPBE/SDD
title: #p freq=noraman PBEPBE/SDD
converged: YES YES NO NO
title: Mulliken charges:
elementType: Br P O O N N C C C C C C C C C C C C C C H H H H H H H H H H H H H H H H H H H H
charge: -0.000204 1.229346 -0.551633 -0.605195 -0.448004 -0.458705 -0.007136 -0.036945 -0.474322 -0.441315 -0.394956 -0.387532 -0.671035 -0.679751 0.372443 -0.334924 -0.370451 -0.158454 -0.157969 -0.231984 0.270167 0.271511 0.274235 0.250123 0.265434 0.243810 0.204462 0.210053 0.202084 0.211580 0.215100 0.231420 0.214996 0.208946 0.246221 0.214904 0.314879 0.255997 0.250610 0.252192
chargesum: 0.00000
title: Mulliken charges with hydrogens summed into heavy atoms:
elementType: Br P O O N N C C C C C C C C C C C C C C
charge: -0.000204 1.229346 -0.551633 -0.605195 -0.448004 -0.458705 0.263031 0.234566 0.050036 0.067928 0.019559 0.026132 -0.009519 -0.009680 0.372443 -0.020045 -0.114454 0.092156 0.094223 -0.231984
polarizability: 2.84662931e+02 -2.60516764e+00 1.79508318e+02 3.42287287e+00 6.63712985e+00 1.74241811e+02
1716.lowfreq: -9.6998 -6.3800 0.0005 0.0007 0.0010 3.8612 7.6678 19.7527 23.5137
frequency: 2.5389 19.2756 23.1699 33.8261 50.7911 60.0638 74.9418 84.1240 92.5809 101.2684 114.8271 143.8241 170.6113 188.6470 195.3163 221.6187 226.5751 253.6490 264.4350 278.7948 303.8933 325.1868 337.5016 345.1485 386.4556 403.3449 412.0722 416.7769 460.2069 475.8840 499.3003 544.8183 566.4048 620.5325 630.0661 661.4961 699.4395 725.0114 745.1648 800.1322 803.7125 817.5626 824.6361 831.1820 836.0796 844.5904 907.9123 939.8041 947.2935 954.9455 959.8065 965.9794 989.1662 1015.2743 1024.3312 1027.5797 1052.2567 1053.6701 1057.3974 1089.2407 1090.7782 1104.5294 1118.8241 1127.9237 1134.6914 1142.0500 1167.6523 1170.1303 1173.5525 1196.5133 1235.3895 1246.0623 1263.3686 1264.7989 1287.7336 1309.3054 1310.4713 1358.2065 1386.5587 1388.1816 1395.1761 1397.6765 1401.2729 1454.8558 1454.8857 1461.0805 1461.7356 1462.6047 1476.1224 1477.1719 1485.3773 1486.0864 1576.5778 1589.7383 2982.5421 2983.3054 2985.0499 2987.3720 3040.6168 3043.3909 3075.1285 3077.3597 3080.1729 3083.3880 3085.6393 3087.8357 3089.3146 3091.0576 3154.0020 3156.7807 3171.7347 3177.4315 3192.3440 3195.9509
redmass: 4.5246 4.6939 3.4931 3.6953 4.3218 3.6725 3.9691 3.0618 3.3961 3.4709 3.6167 4.5425 2.8913 3.5025 4.2168 1.3873 1.6266 4.2299 4.2178 5.3433 4.6528 4.7538 3.2677 4.7764 2.9714 2.9066 3.0092 4.3774 3.5914 4.3431 3.1188 6.8957 5.5461 7.3284 5.8591 9.2582 3.7053 3.3096 2.2834 1.3215 1.3294 1.3012 6.1078 2.3713 1.5010 2.9950 5.0925 3.1114 1.3413 1.3940 1.2116 1.3453 5.1361 3.8003 1.4315 1.5846 1.9197 2.1044 2.4294 1.5988 1.5943 1.3397 1.3222 1.3202 1.4254 1.4366 1.5218 1.9584 1.8366 2.2713 1.7143 1.7625 1.2234 1.2146 1.2508 1.3418 1.3512 6.4951 1.5655 1.4640 3.5034 1.4362 1.5226 1.0843 1.0824 1.3630 1.1712 1.7276 1.0439 1.0468 1.0612 1.0594 7.5005 6.5354 1.0406 1.0376 1.0565 1.0596 1.0983 1.0984 1.0886 1.0963 1.0679 1.0879 1.0802 1.0687 1.1001 1.0984 1.0900 1.0885 1.0966 1.0977 1.1177 1.1183
irintensity: 0.0373 0.1206 0.7151 0.1968 0.7620 2.1389 2.0460 1.5011 2.3521 2.0130 0.7429 5.7204 5.3590 2.3829 1.4864 1.0556 4.1329 1.5201 11.0093 0.4599 2.4837 18.1478 13.1617 1.1046 1.8439 10.6490 0.5022 12.4308 5.9740 17.1606 46.8123 13.0097 27.1984 27.4892 116.1967 227.6967 0.0984 15.2161 6.9848 15.9282 4.5246 11.9956 126.5737 97.5928 88.5688 59.1547 111.5747 144.1883 2.5488 14.2664 12.4546 2.6759 70.8488 47.0690 4.2223 33.0670 3.5178 25.9387 39.2550 3.9815 5.5372 9.2732 12.4316 7.9673 3.0669 3.9980 127.2029 14.3485 9.1889 209.3365 42.0524 46.7586 1.0149 0.1075 0.1753 22.2569 1.9455 6.3705 13.5978 17.7114 3.6775 5.9017 16.3771 5.6527 11.0909 72.4035 16.0880 204.6667 12.4099 8.7404 17.3972 24.0736 13.2112 18.7866 37.5614 32.2380 21.3265 29.3469 4.4136 4.8346 6.2996 18.3036 35.9829 30.4699 42.2409 14.8896 48.2046 45.0965 3.8066 4.3544 5.8764 3.2132 3.7351 7.4874
temp: 298.150 k
press: 1.00000 atm
elementType: 35 15 8 8 7 7 6 6 6 6 6 6 6 6 6 6 6 6 6 6 1 1 1 1 1 1 1 1 1 1 1 1 1 1 1 1 1 1 1 1
symmnumber: 1
zpe: 829608.1 jmol-1
zpe.correction: 0.315981 hartree
zpe.thermalcorrener: 0.338685 hartree
zpe.thermalcorrenthalpy: 0.339629 hartree
zpe.thermalcorrgfe: 0.257939 hartree
zpe.sumelectzpe: -1158.508331 hartree
zpe.sumelectthermal: -1158.485627 hartree
zpe.sumelectthermalent: -1158.484683 hartree
zpe.sumelectthermalfe: -1158.566373 hartree
dipole: 2.5947 1.4653 2.2734
dipole: 3.7480
quadrupole: -139.2899 -125.9100 -134.5311
quadrupole: -3.7383 5.0111 -4.1480
quadrupole: -6.0463 7.3337 -1.2874 -3.7383 5.0111 -4.1480
hfenergy: -1158.8243117 hartree
pointgroup: C01 [X(C14H20Br1N2O2P1)]
dipole: 0.6484785 -0.2051332 -1.3083639 debye
polarizability: 273.7720746|-13.2212803|174.2273182|-28.5865694|9.8457543|190.4136664 unknown
InChI: InChI=1S/C14H20BrN2O2P/c1-3-12-9-16(12)20(18,17-10-13(17)4-2)19-14-7-5-11(15)6-8-14/h5-8,12-13H,3-4,9-10H2,1-2H3
charge 0 multiplicity 1
40 atoms
Br -5.141807 1.447434 2.586799
P  1.553453 -0.776271 0.241666
O  0.290791 0.409841 -0.170292
O  1.659428 -1.123728 1.798807
N  1.17118 -2.092578 -0.891814
N  2.982802 -0.076241 -0.464819
C  0.104545 -3.109969 -0.47318
C  3.325927 1.395604 -0.347391
C  1.566506 -3.500805 -0.448642
C  2.967923 0.793879 -1.699473
C  -0.843295 -3.539303 -1.579414
C  4.749936 1.709901 0.074983
C  -1.948064 -2.492933 -1.842511
C  4.936025 1.582568 1.603301
C  -0.931408 0.588441 0.518316
C  -1.101894 0.302868 1.895016
C  -1.991458 1.128108 -0.246182
C  -2.353459 0.55562 2.501591
C  -3.237052 1.388927 0.364178
C  -3.404969 1.09477 1.733654
H  -0.355367 -2.945244 0.513055
H  2.546297 2.028518 0.102202
H  2.049715 -3.606436 0.530726
H  1.981736 -4.106724 -1.259935
H  1.993864 1.047658 -2.131737
H  3.762213 0.553619 -2.4139
H  -1.294189 -4.510777 -1.292399
H  -0.259014 -3.710511 -2.503011
H  4.995828 2.738127 -0.258899
H  5.4389 1.021139 -0.448843
H  -2.555713 -2.309849 -0.936855
H  -1.497737 -1.531947 -2.148191
H  -2.628308 -2.827936 -2.645902
H  4.280863 2.288301 2.147305
H  4.683775 0.560939 1.93869
H  5.979808 1.795992 1.895298
H  -0.272082 -0.10816 2.478031
H  -1.832489 1.340609 -1.307445
H  -2.495358 0.337633 3.564016
H  -4.059249 1.808715 -0.222199
