program: Gaussian 09
title: 000238858
version: EM64L-G09RevD.01
frameworkgroup: C1[X(C11H21NO5)]
method: RPBEPBE
basis: SDD
operation: Freq
keyword: #p
keyword: freq=noraman
keyword: PBEPBE/SDD
title: #p freq=noraman PBEPBE/SDD
converged: YES YES NO NO
title: Mulliken charges:
elementType: O O O O O N C C C C C C C C C C C H H H H H H H H H H H H H H H H H H H H H
charge: -0.278734 -0.278739 -0.270113 -0.278950 -0.438859 -0.287568 -0.164802 -0.174377 -0.081110 -0.034335 0.338032 -0.398874 -0.688636 -0.696751 -0.370019 -0.500217 -0.320801 0.243659 0.273108 0.271711 0.246609 0.212950 0.218963 0.269487 0.217486 0.219915 0.219885 0.219246 0.241634 0.264607 0.164615 0.230518 0.211964 0.235123 0.218697 0.239847 0.174248 0.330583
chargesum: 0.00000
title: Mulliken charges with hydrogens summed into heavy atoms:
elementType: O O O O O N C C C C C C C C C C C
charge: -0.278734 -0.278739 -0.270113 -0.278950 -0.108276 -0.022962 0.078857 0.098731 0.190602 0.212274 0.338032 0.033038 0.018252 -0.015986 0.025115 0.165566 0.093293
polarizability: 1.74120726e+02 9.68007423e+00 1.31240244e+02 -6.39145197e+00 -1.35157424e+00 1.16839386e+02
1716.lowfreq: -0.0005 0.0008 0.0010 5.5464 6.4062 12.9943 26.3760 34.9292 63.0770
frequency: 26.0103 34.8189 63.0320 69.0675 78.5810 96.5426 101.7348 126.7629 158.4868 162.2845 177.4968 189.5116 192.3248 213.1015 236.1746 250.3884 295.0152 316.6113 331.6105 344.7588 358.6136 385.7812 394.4339 453.8844 487.1657 511.9300 560.9949 625.9863 635.2840 704.5472 713.8760 735.2957 738.1546 784.6080 811.4542 817.2561 867.9801 894.3602 913.7396 922.9473 946.9074 961.3640 979.5181 987.4971 994.7059 1006.8976 1026.9942 1037.6026 1048.9337 1053.0896 1066.2134 1092.4930 1110.1073 1113.4573 1139.3781 1147.7306 1159.3449 1172.9906 1202.0857 1213.7263 1223.0937 1233.2644 1255.1388 1261.8568 1264.7083 1274.5814 1293.1599 1301.2335 1312.1625 1332.5026 1333.8330 1345.7306 1370.9907 1381.4123 1394.7898 1398.0329 1429.4590 1452.4582 1455.3731 1457.0901 1461.5720 1470.0060 1472.2306 1474.8002 1477.0626 1484.8908 1491.1657 2811.8106 2880.4999 2938.3060 2953.3939 2992.1395 2994.9024 3007.0085 3020.9037 3025.4634 3041.6567 3062.1396 3070.9319 3090.3718 3093.8930 3101.2119 3103.1110 3109.1015 3115.6168 3120.9260 3433.7481 3555.8676
redmass: 5.2251 3.9854 4.1832 2.3235 2.1983 2.7128 3.6322 1.5186 2.2306 1.1972 2.6313 3.3455 3.6767 3.2844 2.4111 1.1996 3.5152 1.2804 3.3553 4.2027 3.0754 3.6665 2.6977 4.6575 4.2583 4.0877 3.8604 4.4170 5.0202 1.4738 4.8560 6.6700 3.6487 2.9860 4.5371 1.1908 2.5482 5.3259 3.6378 1.8524 2.4636 3.8918 3.4276 1.3214 2.2267 4.0841 2.4957 4.8132 3.8163 2.4941 1.9721 2.6285 1.4940 1.5266 1.8502 1.3911 2.2759 1.7509 2.4870 1.9234 1.3512 1.3560 1.4282 2.7220 1.4417 1.1707 1.1741 1.2667 1.2674 1.2908 1.2492 1.2790 1.3090 1.2849 1.2191 1.4335 1.1424 1.0504 1.0590 1.0480 1.1983 1.0765 1.0651 1.0573 1.0815 1.0471 1.0864 1.0716 1.0692 1.0712 1.0335 1.0353 1.0889 1.0355 1.0869 1.0859 1.1015 1.0876 1.0875 1.0885 1.0998 1.1010 1.0938 1.0995 1.1002 1.1009 1.0739 1.0661
irintensity: 0.8191 0.3741 0.2381 2.3946 7.4012 4.0172 3.7383 0.9930 5.1888 1.1825 4.3722 4.5333 1.9138 5.3654 0.7968 1.0142 8.0857 124.0667 25.2011 10.5098 1.8166 26.1177 8.0628 4.1285 15.4762 9.6479 16.2005 2.7496 1.7000 62.4187 35.0291 13.9521 25.4550 7.6701 78.7384 8.9844 15.0739 47.6541 43.1064 13.3972 7.2232 68.4755 94.2252 0.0307 4.5203 116.6267 40.9639 150.3669 91.1166 23.0936 28.1882 2.0547 11.3779 8.0780 30.0013 8.6610 27.5042 6.2929 97.1053 6.8460 0.2206 16.9448 0.8842 53.5298 30.4111 4.6211 0.8450 2.6313 0.4414 14.2220 20.1280 15.4051 10.4061 40.3921 32.3234 0.2592 3.7461 4.7690 6.3161 4.0938 55.3200 6.4633 0.2421 16.5233 1.1888 12.2908 3.8192 135.6922 71.8521 67.8378 66.4857 16.6031 29.8955 15.6009 41.5804 35.3155 50.3536 18.1928 15.2317 18.3725 8.1355 5.7489 25.1692 25.0141 23.1408 19.7585 2.5188 7.2858
temp: 298.150 k
press: 1.00000 atm
elementType: 8 8 8 8 8 7 6 6 6 6 6 6 6 6 6 6 6 1 1 1 1 1 1 1 1 1 1 1 1 1 1 1 1 1 1 1 1 1
symmnumber: 1
zpe: 836603.9 jmol-1
zpe.correction: 0.318646 hartree
zpe.thermalcorrener: 0.337727 hartree
zpe.thermalcorrenthalpy: 0.338671 hartree
zpe.thermalcorrgfe: 0.270484 hartree
zpe.sumelectzpe: -861.197308 hartree
zpe.sumelectthermal: -861.178226 hartree
zpe.sumelectthermalent: -861.177282 hartree
zpe.sumelectthermalfe: -861.245469 hartree
dipole: -0.7046 2.6610 -0.0283
dipole: 2.7528
quadrupole: -117.1466 -102.7067 -101.2974
quadrupole: 16.3821 -5.9788 2.7755
quadrupole: -10.0964 4.3436 5.7528 16.3821 -5.9788 2.7755
hfenergy: -861.5159531 hartree
pointgroup: C01 [X(C11H21N1O5)]
dipole: 0.3331152 -1.0013356 -0.243585 debye
polarizability: 173.5570678|11.497244|131.501743|4.173729|3.8803609|117.1415457 unknown
InChI: InChI=1S/C11H21NO5/c1-11(2)16-8-7(6-12-4-5-13)15-10(14-3)9(8)17-11/h7-10,12-13H,4-6H2,1-3H3
charge 0 multiplicity 1
38 atoms
O  2.235382 1.731876 -0.495809
O  3.172243 -0.422286 -0.649273
O  0.203567 -0.596278 0.727414
O  0.053115 -2.225557 -1.07451
O  -6.21653 0.316678 0.582662
N  -2.444956 0.528081 0.397016
C  1.147407 0.862229 -0.970592
C  1.784148 -0.562185 -1.102041
C  -0.021524 0.716828 0.03367
C  0.934627 -1.476367 -0.19302
C  3.322473 0.882101 0.059591
C  -1.408145 0.743907 -0.627484
C  3.161477 0.69834 1.576595
C  4.658311 1.49183 -0.354461
C  -3.824735 0.463369 -0.112827
C  -0.775142 -3.210209 -0.366359
C  -4.826516 0.386023 1.054875
H  0.812767 1.281582 -1.933336
H  1.806038 -0.958762 -2.127889
H  0.03169 1.482155 0.82574
H  1.535568 -2.155775 0.441367
H  -1.43599 -0.010474 -1.452354
H  -1.558026 1.744635 -1.081582
H  2.185195 0.246367 1.819427
H  3.96238 0.041671 1.959195
H  3.236876 1.677798 2.080422
H  4.77699 2.489106 0.102233
H  5.488281 0.846763 -0.01965
H  4.699224 1.590837 -1.450658
H  -2.198455 -0.276557 0.990973
H  -4.000484 -0.404658 -0.805396
H  -4.03306 1.379519 -0.697182
H  -0.142354 -3.929206 0.193284
H  -1.343022 -3.743053 -1.144138
H  -1.46963 -2.713868 0.337806
H  -4.773488 1.302693 1.661536
H  -4.584851 -0.481851 1.709352
H  -6.319456 -0.481503 0.004405
