program: Gaussian 09
title: 000238852
version: EM64L-G09RevD.01
frameworkgroup: C1[X(C11H13ClN4O2)]
method: RPBEPBE
basis: SDD
operation: Freq
keyword: #p
keyword: freq=noraman
keyword: PBEPBE/SDD
title: #p freq=noraman PBEPBE/SDD
converged: NO YES NO NO
title: Mulliken charges:
elementType: Cl O O N N N N C C C C C C C C C C C H H H H H H H H H H H H H
charge: 0.023502 -0.287537 -0.436306 -0.191085 -0.037479 -0.017071 0.061015 -0.010452 -0.406498 -0.425196 0.041791 -0.433555 -0.408943 0.129824 -0.191056 0.130736 -0.305749 -0.356333 0.252322 0.219637 0.231716 0.233244 0.211518 0.213589 0.215015 0.207851 0.245142 0.203181 0.286470 0.344754 0.255954
chargesum: 0.00000
title: Mulliken charges with hydrogens summed into heavy atoms:
elementType: Cl O O N N N N C C C C C C C C C C C
charge: 0.023502 -0.287537 -0.091551 -0.191085 -0.037479 -0.017071 0.061015 0.241869 0.044854 0.019566 0.255380 -0.010689 0.039380 0.129824 0.095414 0.130736 -0.305749 -0.100379
polarizability: 2.27701097e+02 4.52408597e+00 1.41344071e+02 9.56197950e+00 -2.10082446e+01 1.13391495e+02
1716.lowfreq: -11.6614 -4.2985 -0.0002 0.0018 0.0022 6.2422 7.7847 38.2931 49.6493
frequency: -4.3515 38.2400 49.6322 72.4441 109.7407 141.0385 156.9749 181.6378 196.3354 222.6652 241.0803 259.3635 276.4651 291.7095 340.8520 379.4709 391.3568 428.6539 466.2677 487.5603 531.0676 548.1741 552.9284 619.9364 625.3765 646.8714 655.6440 761.9669 790.0621 796.5915 804.5102 841.4999 852.6512 867.0736 887.2535 907.6305 915.1452 930.6887 967.4041 986.4675 1015.0543 1047.4796 1077.4620 1085.2987 1094.7773 1112.3221 1126.5379 1152.5935 1172.8123 1177.2514 1205.3796 1217.7626 1252.7023 1271.2521 1285.6053 1294.8607 1303.9284 1305.1155 1323.9044 1329.7180 1339.7027 1344.6773 1359.5281 1366.9297 1370.2806 1384.7750 1399.8981 1446.7471 1448.9616 1455.6788 1467.6214 1470.1554 1505.3831 1563.2676 2952.5061 2970.3485 2977.1976 2981.9388 2982.6062 2997.9789 3046.5035 3055.9903 3067.2403 3100.5050 3186.8459 3251.8512 3575.7332
redmass: 5.5216 8.7914 4.0791 3.8522 6.4403 2.8587 6.6090 6.3685 5.8463 5.8661 3.2892 3.1246 2.4368 1.3923 4.8300 16.6343 4.2179 2.5914 3.5404 3.4023 2.4908 5.0070 6.5256 7.2160 7.0815 4.8425 6.7068 3.9226 7.3869 2.2564 8.5273 2.4367 1.5171 2.8065 2.0181 2.8294 1.4352 3.4566 1.9087 3.6999 3.0669 2.5107 1.9273 3.4912 1.9308 4.4296 2.3291 2.0820 3.3708 1.3851 2.0633 1.4971 1.2850 2.3445 1.4838 2.9061 2.7385 1.6345 1.3635 1.3293 1.3234 1.3653 1.5613 4.8894 1.2698 1.4774 1.9844 1.7899 1.6109 1.1690 1.0889 1.0835 9.3469 11.1746 1.0830 1.0844 1.0628 1.0654 1.0661 1.0609 1.0991 1.0988 1.1038 1.0980 1.0929 1.0989 1.0666
irintensity: 0.6558 0.5201 1.2959 3.7821 1.6568 4.9305 2.6083 2.3506 0.9578 0.7885 4.0032 16.4111 45.5654 127.4733 3.2653 8.3690 3.5669 0.8405 4.9906 4.1995 8.6686 2.3197 18.1776 2.9465 5.2905 17.7873 1.7818 35.7832 2.6965 5.3105 22.6418 5.4245 15.7951 59.8299 45.2934 11.9597 12.8220 34.7147 140.8888 0.7298 189.1284 13.8578 27.9512 28.5294 6.3439 7.3949 12.4686 42.3842 22.3183 11.9656 175.8240 19.9948 14.7169 7.9466 18.8468 22.8067 81.5001 18.1820 11.5480 1.6689 8.2947 4.1552 6.8829 20.5488 5.9216 6.6337 69.7786 99.0480 46.2389 25.7949 21.6721 1.3979 121.1817 107.0698 14.2086 4.8522 26.4354 14.1403 69.3302 22.0837 39.1005 29.6103 35.4492 19.2816 8.9107 1.1886 11.8979
temp: 298.150 k
press: 1.00000 atm
elementType: 17 8 8 7 7 7 7 6 6 6 6 6 6 6 6 6 6 6 1 1 1 1 1 1 1 1 1 1 1 1 1
symmnumber: 1
zpe: 622914.1 jmol-1
zpe.correction: 0.237255 hartree
zpe.thermalcorrener: 0.252324 hartree
zpe.thermalcorrenthalpy: 0.253268 hartree
zpe.thermalcorrgfe: 0.194153 hartree
zpe.sumelectzpe: -1255.124467 hartree
zpe.sumelectthermal: -1255.109399 hartree
zpe.sumelectthermalent: -1255.108455 hartree
zpe.sumelectthermalfe: -1255.167570 hartree
dipole: 6.4409 2.2871 2.7681
dipole: 7.3742
quadrupole: -125.6060 -113.2255 -113.8346
quadrupole: -1.1041 14.3815 0.0163
quadrupole: -8.0506 4.3298 3.7208 -1.1041 14.3815 0.0163
hfenergy: -1255.3617227 hartree
pointgroup: C01 [X(C11H13Cl1N4O2)]
dipole: 2.5444138 -1.258372 -0.5995938 debye
polarizability: 227.7559763|-8.827977|129.6922319|-0.2401065|-25.6817261|124.9884546 unknown
InChI: InChI=1S/C11H13ClN4O2/c12-10-9-11(14-5-13-10)16(6-15-9)8-3-1-2-7(4-17)18-8/h5-8,17H,1-4H2
charge 0 multiplicity 1
31 atoms
Cl -5.119801 1.224767 -0.987839
O  1.929373 0.557335 0.18842
O  5.386375 1.192692 1.417913
N  -0.253929 -0.013538 -0.420214
N  -1.78876 1.296972 -1.526398
N  -1.782969 -1.251012 1.083379
N  -4.117213 -0.598776 0.756855
C  1.033909 -0.588128 -0.02114
C  1.610975 -1.551551 -1.077493
C  3.0133 -2.029973 -0.632927
C  3.266789 0.128424 0.678479
C  3.936076 -0.824194 -0.332016
C  4.032178 1.444142 0.910687
C  -1.498629 -0.345194 0.114266
C  -0.490039 0.97427 -1.390815
C  -2.445664 0.477234 -0.593189
C  -3.788478 0.283606 -0.20197
C  -3.116524 -1.323663 1.358712
H  0.860865 -1.125245 0.935885
H  1.67796 -1.021226 -2.046733
H  0.922002 -2.406689 -1.204164
H  3.45839 -2.671627 -1.414139
H  2.917421 -2.655187 0.278112
H  3.135898 -0.401529 1.647998
H  4.896859 -1.18018 0.085831
H  4.150917 -0.269042 -1.267763
H  3.530623 2.032632 1.694427
H  4.040803 2.035625 -0.028371
H  0.324862 1.438005 -1.94017
H  5.974558 0.91939 0.670465
H  -3.428126 -2.026138 2.135115
