program: Gaussian 09
title: 000238871
version: EM64L-G09RevD.01
frameworkgroup: C1[X(C13H17Cl2NO2)]
method: RPBEPBE
basis: SDD
operation: Freq
keyword: #p
keyword: freq=noraman
keyword: PBEPBE/SDD
title: #p freq=noraman PBEPBE/SDD
converged: YES YES NO NO
title: Mulliken charges:
elementType: Cl Cl O O N C C C C C C C C C C C C C H H H H H H H H H H H H H H H H H
charge: -0.056366 -0.052565 -0.413242 -0.241043 -0.222406 0.267160 0.415193 -0.417291 -0.365309 -0.595519 -0.348157 -0.423212 -0.499340 -0.590091 -0.596137 -0.261843 -0.255129 0.194811 0.255930 0.261490 0.241104 0.273781 0.248185 0.236542 0.228846 0.231972 0.268637 0.277243 0.274478 0.270159 0.266911 0.287125 0.229130 0.231681 0.377275
chargesum: 0.00000
title: Mulliken charges with hydrogens summed into heavy atoms:
elementType: Cl Cl O O N C C C C C C C C C C C C C
charge: -0.056366 -0.052565 -0.035967 -0.241043 -0.222406 0.267160 0.415193 0.100128 0.149576 -0.110793 -0.119311 -0.191240 0.046540 -0.045454 -0.042101 -0.032714 -0.023448 0.194811
polarizability: 1.90944120e+02 5.82853430e+00 1.96900500e+02 -1.36773846e+01 1.26940757e+01 1.39190426e+02
1716.lowfreq: -8.4175 -5.3370 -0.0024 -0.0022 -0.0014 5.9554 17.7105 23.5904 29.8381
frequency: 17.6338 23.5071 29.8004 37.4332 52.8295 58.3904 68.4755 95.0017 132.8201 141.7279 163.6500 187.1412 207.9609 217.0801 238.4049 274.8598 295.4507 373.1657 380.6807 392.6632 418.2218 471.4763 494.8030 527.2304 563.5684 566.7719 569.1803 615.5408 661.5016 673.2199 685.1031 713.9768 736.5009 760.4570 777.3553 784.0073 793.0287 816.8410 852.4845 891.9275 938.6950 950.5237 977.1127 998.2686 1002.4262 1021.0433 1023.9743 1032.0644 1042.1568 1064.2579 1072.7532 1101.2246 1119.5461 1161.7131 1168.6068 1177.1363 1199.7919 1215.9284 1241.9823 1247.7784 1254.9494 1255.5248 1270.0194 1283.7597 1302.4732 1328.4002 1344.5095 1356.0292 1363.1301 1371.6551 1381.5871 1436.6463 1453.6113 1456.5394 1458.2505 1473.3583 1475.3682 1491.2367 1514.9691 1577.6278 1608.2896 1657.7229 2985.0000 2993.3063 3001.6162 3019.2650 3045.5389 3055.2863 3058.1483 3070.6049 3078.6113 3082.1937 3118.9299 3133.4782 3140.6031 3142.4081 3153.9834 3168.3277 3504.7781
redmass: 11.4944 11.0716 10.3335 11.3682 5.3502 6.0568 4.0449 2.6634 2.7949 2.8207 3.8498 6.0354 6.5467 4.2603 4.7019 3.9275 3.1439 2.9465 3.4813 5.8673 3.2957 3.5093 2.7840 3.0442 3.5585 3.3174 4.2494 3.6219 1.5568 6.2175 5.4414 3.6253 2.1892 1.5299 1.2171 1.1852 1.3700 4.7694 1.4902 3.7268 1.4638 2.9682 1.3277 1.5664 1.9273 3.8672 2.7144 2.4763 2.6812 2.0886 2.2183 2.1760 1.5857 1.3530 1.4047 1.1129 1.7103 2.1967 1.3668 1.2516 1.2059 1.2237 1.4158 1.3730 1.2969 1.6065 1.4351 1.3300 1.6575 3.5812 1.5216 2.2404 1.0992 1.0949 1.1073 1.2144 1.1329 1.9670 1.0795 6.6881 6.1870 8.1735 1.0661 1.0658 1.0607 1.0602 1.0983 1.0575 1.0567 1.1020 1.0980 1.0953 1.0878 1.0879 1.1111 1.1113 1.0927 1.1000 1.0638
irintensity: 1.4941 0.6537 0.2985 1.0402 1.0288 0.3088 0.0506 1.1610 1.5246 0.0790 3.7525 4.3928 7.5027 2.5284 1.1214 1.2118 7.4329 1.1477 6.7561 26.3935 6.2781 4.3390 14.1528 36.7138 8.8722 45.7125 13.0360 14.8754 106.6928 37.8570 63.8793 23.8071 12.9770 66.5135 25.5274 11.4177 6.8574 3.1171 0.5262 2.1769 1.2864 20.0264 0.1639 1.6653 28.3695 90.7951 14.6728 8.2832 1.0359 30.8078 182.9117 26.5096 39.9853 31.4008 15.2951 1.2039 11.7813 9.7263 7.6578 23.0647 19.0076 6.4863 20.7362 13.9487 8.3654 20.0351 23.3514 14.4469 61.3027 2.4006 8.7079 26.0987 14.3604 12.6718 3.7162 9.7361 19.3875 122.2178 21.2689 13.1457 36.6652 200.6635 21.0197 23.3209 17.3873 18.7601 13.1837 15.3773 19.9162 8.2220 7.8636 8.8459 12.2823 8.6690 9.8433 20.3073 30.1986 20.0565 24.2664
temp: 298.150 k
press: 1.00000 atm
elementType: 17 17 8 8 7 6 6 6 6 6 6 6 6 6 6 6 6 6 1 1 1 1 1 1 1 1 1 1 1 1 1 1 1 1 1
symmnumber: 1
zpe: 732034.4 jmol-1
zpe.correction: 0.278817 hartree
zpe.thermalcorrener: 0.297851 hartree
zpe.thermalcorrenthalpy: 0.298795 hartree
zpe.thermalcorrgfe: 0.227050 hartree
zpe.sumelectzpe: -1629.531924 hartree
zpe.sumelectthermal: -1629.512891 hartree
zpe.sumelectthermalent: -1629.511947 hartree
zpe.sumelectthermalfe: -1629.583691 hartree
dipole: -0.4994 2.4363 -0.7426
dipole: 2.5955
quadrupole: -124.8617 -124.6374 -126.8214
quadrupole: -1.1545 10.2958 10.6764
quadrupole: 0.5785 0.8027 -1.3812 -1.1545 10.2958 10.6764
hfenergy: -1629.8107413 hartree
pointgroup: C01 [X(C13H17Cl2N1O2)]
dipole: -0.4038017 0.6897375 -0.6355761 debye
polarizability: 162.5669352|-9.4191157|193.2547394|-29.5807566|-13.2457534|171.2133715 unknown
InChI: InChI=1S/C13H17Cl2NO2/c14-7-9-16(10-8-15)12-4-2-1-3-11(12)5-6-13(17)18/h1-4,17H,5-10H2
charge 0 multiplicity 1
35 atoms
Cl 3.190853 -2.846443 -2.96554
Cl 1.951737 -1.53822 3.480437
O  -4.461553 -1.36811 0.524249
O  -3.008404 -1.298821 2.332058
N  0.708012 -0.671623 -0.40041
C  0.553635 0.745778 -0.572274
C  -0.45075 1.500599 0.128554
C  1.201193 -1.497461 -1.523307
C  0.781912 -1.296415 0.942712
C  -1.523438 0.876146 1.011859
C  1.389934 1.430316 -1.503066
C  -0.508753 2.902353 -0.084712
C  -2.406784 -0.135584 0.233796
C  2.719323 -1.773829 -1.479348
C  1.897874 -0.673812 1.801259
C  1.283169 2.817477 -1.719859
C  0.340768 3.572681 -0.989067
C  -3.275692 -0.964686 1.155095
H  0.673923 -2.471277 -1.512502
H  0.943196 -1.001303 -2.473933
H  0.98677 -2.372666 0.803324
H  -0.172226 -1.233437 1.493766
H  -1.109149 0.373611 1.905284
H  -2.170235 1.681832 1.404127
H  2.154076 0.875193 -2.05551
H  -1.272012 3.473652 0.458095
H  -3.038614 0.372813 -0.513204
H  -1.755255 -0.834733 -0.328651
H  3.330239 -0.863181 -1.561343
H  3.018343 -2.359183 -0.596724
H  2.897795 -0.808126 1.362081
H  1.714173 0.388891 2.01738
H  1.9477 3.304341 -2.442211
H  0.257333 4.655003 -1.130636
H  -4.98569 -1.939876 1.149823
