program: Gaussian 09
title: 000238832
version: EM64L-G09RevD.01
frameworkgroup: C1[X(C10H9Br2ClO2)]
method: RPBEPBE
basis: SDD
operation: Freq
keyword: #p
keyword: freq=noraman
keyword: PBEPBE/SDD
title: #p freq=noraman PBEPBE/SDD
converged: YES YES NO NO
title: Mulliken charges:
elementType: Br Br Cl O O C C C C C C C C C C H H H H H H H H H
charge: 0.017475 0.036303 -0.002319 -0.265095 -0.217715 -0.390670 -0.277857 -0.662138 0.336951 0.191074 -0.284793 -0.300178 -0.215490 -0.232368 -0.207388 0.341368 0.266343 0.243854 0.291981 0.301576 0.282503 0.262549 0.242447 0.241586
chargesum: 0.00000
title: Mulliken charges with hydrogens summed into heavy atoms:
elementType: Br Br Cl O O C C C C C C C C C C
charge: 0.017475 0.036303 -0.002319 -0.265095 -0.217715 -0.049303 0.232340 -0.068580 0.336951 0.191074 -0.284793 -0.017675 0.047059 0.010080 0.034199
polarizability: 1.92714818e+02 -9.06547152e+00 1.72419892e+02 8.92510440e+00 -8.06182762e+00 9.46043457e+01
1716.lowfreq: -8.2482 -4.5215 -0.2985 -0.0017 -0.0014 -0.0012 12.6771 21.9375 27.9302
frequency: 12.3162 21.8152 27.9242 45.5378 70.6501 102.8798 120.3012 142.9701 179.3886 195.3819 234.4248 275.7129 300.2373 343.3247 361.5993 400.7043 431.0709 467.4636 494.6115 510.5915 522.3657 632.4895 645.0189 674.5079 695.4685 745.7577 759.9842 781.1912 856.0849 881.2362 937.6173 969.1252 969.3772 999.7391 1009.1968 1033.8589 1040.9531 1062.2343 1065.9321 1127.8171 1133.4676 1177.2211 1211.9950 1225.7844 1234.6758 1267.8596 1290.6865 1308.9435 1371.3398 1376.3018 1418.6821 1422.9413 1435.4708 1459.7214 1569.1422 1600.4503 1636.9449 3005.7630 3038.1523 3094.6770 3112.2245 3130.9448 3144.0014 3161.3108 3175.5495 3184.9251
redmass: 9.8336 17.6074 9.2706 14.0616 9.1196 5.8900 10.0139 4.0051 7.3089 6.7701 7.3535 4.6311 4.1052 10.0214 4.0503 4.1075 4.5103 4.7125 4.4816 3.8536 4.3115 6.2650 5.9573 5.0608 6.2971 2.4737 5.1314 1.7128 1.5152 1.3903 6.9306 1.3858 1.8616 1.3522 5.6061 4.1708 3.4307 3.4925 2.5779 1.1851 1.6067 1.0620 1.2954 3.0842 1.1613 1.4251 1.1445 1.2150 1.6465 3.6248 2.0779 1.1033 1.0943 2.4310 6.3307 6.7792 11.0453 1.0622 1.0580 1.0895 1.1003 1.1059 1.0868 1.0916 1.0957 1.0987
irintensity: 1.1492 0.4122 0.9075 1.3091 1.1730 0.8025 1.1772 2.1956 0.1668 1.9985 0.3996 3.2601 8.4598 0.6544 17.9001 15.7594 5.5005 4.9351 7.6966 8.4551 11.6286 5.2470 28.7407 18.4312 8.8420 45.4751 30.3591 37.3632 15.8026 0.1968 1.3465 1.9188 32.0041 0.7779 245.0007 21.0230 22.7115 126.1874 9.0603 9.7807 17.1532 4.1723 78.6443 209.9858 13.6405 14.6478 26.5361 29.8843 2.8639 9.6214 22.1062 2.8579 33.7679 41.5901 16.6591 32.5398 178.2432 20.5055 14.1765 1.1288 2.7528 4.0260 2.9223 8.5434 4.4949 9.1505
temp: 298.150 k
press: 1.00000 atm
elementType: 35 35 17 8 8 6 6 6 6 6 6 6 6 6 6 1 1 1 1 1 1 1 1 1
symmnumber: 1
zpe: 438658.9 jmol-1
zpe.correction: 0.167076 hartree
zpe.thermalcorrener: 0.182499 hartree
zpe.thermalcorrenthalpy: 0.183443 hartree
zpe.thermalcorrgfe: 0.118480 hartree
zpe.sumelectzpe: -1022.785375 hartree
zpe.sumelectthermal: -1022.769953 hartree
zpe.sumelectthermalent: -1022.769008 hartree
zpe.sumelectthermalfe: -1022.833972 hartree
dipole: -2.2968 1.8916 1.9706
dipole: 3.5688
quadrupole: -103.2951 -114.8701 -109.6365
quadrupole: -12.3087 10.9536 -3.5818
quadrupole: 5.9721 -5.6029 -0.3693 -12.3087 10.9536 -3.5818
hfenergy: -1022.9524517 hartree
pointgroup: C01 [X(C10H9Br2Cl1O2)]
dipole: -0.8422777 -0.4553198 -1.0269919 debye
dipolederiv: -0.1574907 0.0027687 -0.0029463 -0.0099588 -0.51085 0.0735038 -0.0151726 0.0071711 -0.1128795 -0.3745498 -0.0209247 -0.1309007 -0.0090551 -0.0631024 0.0053394 -0.2818623 -0.0242604 -0.2779564 -0.0755032 0.0514267 0.0252441 0.1145009 -0.6897141 -0.1333296 0.0334016 -0.1146066 -0.0593803 -1.6429845 0.1825526 0.2074448 0.3152594 -0.4041017 -0.1550896 0.6264761 -0.1707583 -0.5535426 -0.7867083 -0.1948726 -0.0370201 -0.1114075 -0.6700383 -0.2018788 0.1412918 -0.1806656 -0.4177688 -0.0679898 -0.0325943 0.0241942 -0.0060644 0.8561604 0.065107 -0.1207418 -0.0980259 -0.1296097 0.8917134 -0.1321253 -0.0800168 0.1298685 0.0064262 -0.0719299 0.021825 -0.0204878 0.3353868 0.412002 0.0861327 0.3015227 -0.0440037 -0.1037247 -0.0417124 0.3395518 0.0666273 0.4587753 -0.6954881 -0.1376106 0.0741335 -0.196647 -0.3143714 -0.0485013 0.1059398 -0.0500651 -0.0154283 2.1099829 0.100545 -0.2989629 -0.0532472 0.8604245 0.3987726 -0.7733125 0.3661835 0.6096112 0.2865308 0.1463679 -0.0226181 -0.2991168 1.0657406 0.2282109 -0.1733937 0.1558464 -0.0061982 0.1052698 0.0007076 -0.0433074 0.1935884 0.0214509 -0.0130685 0.0641109 0.033931 -0.0871658 -0.0621204 -0.1983807 -0.0554654 -0.1243436 -0.4025855 -0.0354918 -0.0353611 -0.0128939 -0.100255 -0.2963962 0.0697166 0.0330034 0.0238335 0.1036109 0.0563971 0.0283644 0.0417248 -0.1533158 0.143052 -0.015125 -0.0608514 0.0286313 0.1563566 0.0517673 -0.046783 0.0561217 -0.0990644 0.0827124 0.0130696 0.0357772 0.0166386 -0.0736204 -0.0465284 0.0649198 0.022783 0.0272735 -0.0151849 0.01563 0.0606445 0.015407 0.1032962 -0.0773276 0.0494503 -0.0229168 -0.0211943 -0.002621 0.0584088 -0.0032143 -0.091919 -0.06055 0.0520958 -0.0650992 0.0310207 0.0989966 0.0339712 0.002226 -0.0856958 0.0230114 -0.0663631 0.0453406 -0.0752341 0.0577518 0.0131809 0.0081193 -0.0057187 -0.0468322 0.0499709 0.1004064 -0.0393827 0.0087089 -0.0326092 -0.1010632 0.0742698 0.0515774 0.0288446 0.0828372 0.0651885 -0.0215144 0.0240698 -0.0302277 0.1390866 0.0057702 0.0442718 0.0388134 0.0647669 0.0570735 -0.0354254 0.0469652 -0.0263101 0.1494771 0.0810106 -0.0060007 0.0136654 -0.0334451 -0.0826746 -0.0488564 0.0035816 -0.0477349 0.152447 -0.0573673 -0.0820487 0.0245434 -0.0791057 0.0455616 -0.0064978 0.0283034 -0.007599 0.1505871 unknown
polarizability: 194.3813835|7.9371675|169.8931869|4.6150976|13.0649978|95.4644846 unknown
InChI: InChI=1S/C10H9Br2ClO2/c11-5-7(12)6-15-10(14)8-3-1-2-4-9(8)13/h1-4,7H,5-6H2
charge 0 multiplicity 1
24 atoms
Br 3.133382 -2.020189 0.140494
Br 5.45458 0.397525 1.699303
Cl -2.643111 2.531576 0.689797
O  0.734649 -0.069198 -0.974069
O  0.266807 1.752004 0.405839
C  2.986731 0.009798 0.105325
C  2.116094 0.434557 -1.092705
C  4.373177 0.644402 0.015457
C  -1.460464 0.050383 -0.045678
C  -0.12029 0.696662 -0.14362
C  -2.635189 0.747293 0.349318
C  -1.576166 -1.342493 -0.325798
C  -3.874948 0.085816 0.463467
C  -2.807411 -2.012393 -0.206869
C  -3.960558 -1.296215 0.189816
H  2.492054 0.262271 1.055676
H  2.487582 0.009264 -2.037684
H  2.092744 1.540653 -1.141055
H  4.283592 1.738846 -0.095302
H  4.982169 0.219715 -0.796526
H  -0.673657 -1.879771 -0.628699
H  -4.760997 0.652822 0.762481
H  -2.867947 -3.084144 -0.419346
H  -4.925426 -1.804987 0.286182
