program: Gaussian 09
title: 000238872
version: EM64L-G09RevD.01
frameworkgroup: C1[X(C26H18)]
method: RPBEPBE
basis: SDD
operation: Freq
keyword: #p
keyword: freq=noraman
keyword: PBEPBE/SDD
title: #p freq=noraman PBEPBE/SDD
converged: YES YES NO NO
title: Mulliken charges:
elementType: C C C C C C C C C C C C C C C C C C C C C C C C C C H H H H H H H H H H H H H H H H H H
charge: 0.402041 -0.001746 -0.001813 0.137894 0.137844 -0.117029 -0.321949 -0.321773 -0.422655 -0.422647 0.298273 0.298256 -0.284740 -0.284788 -0.241706 -0.241731 -0.362422 -0.362405 -0.362348 -0.362320 -0.233041 -0.233045 -0.233048 -0.233057 -0.244103 -0.244104 0.269628 0.269599 0.246313 0.246302 0.226231 0.226226 0.226664 0.226673 0.237527 0.237544 0.237477 0.237476 0.228126 0.228127 0.228122 0.228121 0.229003 0.229001
chargesum: 0.00000
title: Mulliken charges with hydrogens summed into heavy atoms:
elementType: C C C C C C C C C C C C C C C C C C C C C C C C C C
charge: 0.402041 -0.001746 -0.001813 0.137894 0.137844 -0.117029 -0.052321 -0.052174 -0.176342 -0.176345 0.298273 0.298256 -0.058509 -0.058562 -0.015042 -0.015058 -0.124895 -0.124861 -0.124872 -0.124844 -0.004915 -0.004917 -0.004926 -0.004936 -0.015100 -0.015103
polarizability: 3.30115223e+02 3.90067307e-03 3.56297441e+02 -2.25274507e-03 3.12236920e-02 1.78238245e+02
1716.lowfreq: -43.0581 -11.2521 -9.3467 -4.0258 -0.0005 -0.0003 0.0004 18.0032 38.3143
frequency: -43.0577 15.3036 38.3140 49.4732 55.6514 56.1750 96.0371 137.4215 140.2371 177.6695 189.6844 220.0675 246.9957 257.6887 270.7600 294.4472 383.6367 390.6432 397.2534 417.7906 426.4303 460.0947 474.6050 507.6481 508.2980 560.0868 566.0524 586.0985 611.8203 615.4249 616.5263 620.9820 644.8842 687.3813 690.2650 696.8329 708.1868 738.8069 739.2390 751.3758 751.4630 770.3961 776.9124 790.4210 841.7499 847.5679 848.9429 856.6691 875.9704 880.0795 910.5480 931.9430 952.9220 953.4243 956.9158 973.0453 978.1255 985.8118 986.7079 987.8854 988.0309 994.0174 994.9576 996.0821 1024.1382 1028.7575 1028.8413 1038.9588 1072.9464 1080.0493 1081.0420 1114.3538 1135.2104 1168.6708 1171.8749 1172.3880 1176.2446 1185.9926 1189.1275 1209.4647 1211.4671 1246.8411 1268.8404 1300.5570 1306.6242 1306.9136 1313.4126 1361.1016 1367.0399 1374.9288 1402.2056 1424.1754 1429.3002 1436.0979 1443.6181 1465.6477 1471.0859 1475.0407 1481.5274 1577.6988 1581.7129 1584.3485 1585.4737 1603.0788 1603.2177 1612.8524 1613.1111 1637.3422 3122.3052 3122.5010 3123.3428 3123.6814 3126.4409 3128.9174 3135.5225 3137.4286 3139.2805 3141.3154 3148.1742 3149.6967 3155.2448 3156.1647 3164.4840 3164.9940 3187.8047 3188.7193
redmass: 3.9256 3.8524 4.9226 5.2580 4.2795 5.2921 4.3403 5.1526 3.6719 5.7183 5.1364 4.7621 4.5771 4.2831 5.5514 4.2437 4.1373 2.7993 2.9279 6.5265 3.3658 3.0813 3.6384 5.1435 3.9930 7.2462 3.3186 5.1344 6.4641 5.5965 7.0387 5.0198 6.2102 5.9514 6.6844 1.9167 1.7279 2.1942 4.5595 1.7163 1.5958 2.4050 1.8916 2.3871 6.0657 4.0165 1.2546 1.2465 1.3281 1.4972 1.4722 1.5380 1.4103 1.4349 5.7424 1.3921 1.3787 1.3397 6.3070 1.3255 6.2533 2.2884 2.1623 1.3053 2.4794 2.0430 2.3483 1.8459 1.6256 3.0342 1.6116 1.7734 1.9650 1.1478 1.0525 1.0515 1.1082 1.1130 1.1376 2.1740 2.8734 2.0910 3.4448 1.4388 1.7258 1.8666 1.3749 5.2025 6.5023 8.7047 3.3092 2.2186 2.2384 2.2803 2.7565 2.6267 2.6169 2.3429 3.2468 5.8441 5.9819 6.6799 6.1301 6.4126 6.1252 7.3309 6.9953 10.1294 1.0855 1.0846 1.0845 1.0854 1.0875 1.0876 1.0912 1.0914 1.0922 1.0924 1.0967 1.0967 1.0980 1.0981 1.1017 1.1017 1.0941 1.0943
irintensity: 0.0000 0.0152 0.0000 0.2341 0.3520 0.0971 0.9211 1.8054 0.0000 0.0319 0.5180 0.5335 0.0000 0.1515 0.0668 0.0000 0.2564 0.0000 0.2128 0.4823 3.9606 0.0000 3.9794 1.0255 3.4833 6.5285 0.0000 1.0195 0.0000 3.0892 5.2601 31.6035 3.4508 0.9218 6.9605 22.4558 79.5010 63.0981 14.1590 27.2120 0.0016 35.0816 85.0486 0.0000 0.8102 0.0530 0.0000 0.2613 2.2951 0.0000 0.0793 2.1642 1.2840 0.0022 0.0021 0.0000 0.0752 0.0000 1.1862 0.6574 5.4864 1.1931 1.4701 0.4698 6.6953 11.9950 9.2486 2.8210 0.0000 0.0001 21.2856 0.1562 1.3306 0.0257 0.0000 0.0353 0.1053 0.1864 2.4335 0.0841 1.4428 0.0074 5.0713 0.0000 0.0092 3.6576 1.9987 0.0000 0.0329 7.8901 0.4215 0.0000 15.7119 20.3887 35.1698 4.3466 0.5271 17.6071 39.5005 0.0000 3.7493 1.2788 0.8104 19.6718 6.4041 9.2395 1.2846 6.5061 5.4029 2.8647 1.8570 0.0320 0.0000 0.9533 9.8747 14.7845 21.1268 10.9307 0.0018 64.7618 41.4268 44.3962 29.6158 24.8648 21.0566 0.3847
temp: 298.150 k
press: 1.00000 atm
elementType: 6 6 6 6 6 6 6 6 6 6 6 6 6 6 6 6 6 6 6 6 6 6 6 6 6 6 1 1 1 1 1 1 1 1 1 1 1 1 1 1 1 1 1 1
symmnumber: 1
zpe: 914283.2 jmol-1
zpe.correction: 0.348232 hartree
zpe.thermalcorrener: 0.367314 hartree
zpe.thermalcorrenthalpy: 0.368258 hartree
zpe.thermalcorrgfe: 0.299284 hartree
zpe.sumelectzpe: -999.850362 hartree
zpe.sumelectthermal: -999.831280 hartree
zpe.sumelectthermalent: -999.830336 hartree
zpe.sumelectthermalfe: -999.899310 hartree
dipole: -1.0807 0.0002 0.0001
dipole: 1.0807
quadrupole: -139.3448 -132.6451 -145.6028
quadrupole: 0.0018 0.0017 0.0060
quadrupole: -0.1473 6.5525 -6.4052 0.0018 0.0017 0.0060
hfenergy: -1000.1985941 hartree
pointgroup: C01 [X(C26H18)]
dipole: -0.0017695 0.425189 0.0000549 debye
polarizability: 356.2969732|0.110778|330.1156911|0.0312135|0.0023895|178.238245 unknown
InChI: InChI=1S/C26H18/c1-3-11-19(12-4-1)25(20-13-5-2-6-14-20)26-23-17-9-7-15-21(23)22-16-8-10-18-24(22)26/h1-18H
charge 0 multiplicity 1
44 atoms
C  0.00229 -0.563809 -0.0002
C  -1.187558 -1.476784 -0.000239
C  1.19997 -1.466451 -0.000278
C  -0.724113 -2.83388 -0.00028
C  0.748318 -2.827503 -0.00032
C  -0.003557 0.814054 -0.000097
C  -2.577167 -1.221135 -0.000161
C  2.587315 -1.198839 -0.000407
C  -1.625731 -3.91594 -0.000273
C  1.659281 -3.901727 -0.000421
C  -1.263166 1.640393 -0.00032
C  1.249174 1.650787 0.000309
C  -3.482509 -2.310931 -0.000152
C  3.502066 -2.280752 -0.000519
C  -3.014931 -3.647489 -0.000213
C  3.046121 -3.621305 -0.000511
C  -1.849155 2.063613 -1.222027
C  1.831742 2.078383 1.222128
C  -1.848785 2.064838 1.221139
C  1.831153 2.080527 -1.221035
C  -3.002712 2.879578 -1.222633
C  2.978366 2.904059 1.222953
C  -3.002355 2.880785 1.221271
C  2.977796 2.906177 -1.220958
C  -3.583908 3.291536 -0.0008
C  3.555952 3.321377 0.001224
H  -2.967669 -0.202076 -0.000104
H  2.969219 -0.176503 -0.000427
H  -1.263529 -4.950093 -0.000305
H  1.306007 -4.938974 -0.000447
H  -4.560142 -2.112664 -0.000095
H  4.577935 -2.073121 -0.000615
H  -3.731756 -4.476413 -0.000206
H  3.770065 -4.444013 -0.000592
H  -1.407699 1.740264 -2.171563
H  1.393113 1.750937 2.171572
H  -1.407015 1.742488 2.170868
H  1.392051 1.754797 -2.17085
H  -3.446606 3.191818 -2.174684
H  3.419738 3.219615 2.175084
H  -3.445969 3.19397 2.173141
H  3.418725 3.223385 -2.172745
H  -4.477523 3.925631 -0.000982
H  4.444257 3.96289 0.001572
