program: Gaussian 09
title: 000238829
version: EM64L-G09RevD.01
frameworkgroup: C1[X(C11H12Br2O2)]
method: RPBEPBE
basis: SDD
operation: Freq
keyword: #p
keyword: freq=noraman
keyword: PBEPBE/SDD
title: #p freq=noraman PBEPBE/SDD
converged: YES YES NO NO
title: Mulliken charges:
elementType: Br Br O O C C C C C C C C C C C H H H H H H H H H H H H
charge: 0.019047 0.031347 -0.263622 -0.256757 -0.390864 -0.278338 0.224775 0.447370 -0.662118 -0.340510 -0.315750 0.186799 -0.375005 -0.376778 -0.802795 0.341926 0.264052 0.240720 0.291104 0.300769 0.267839 0.271230 0.237387 0.236719 0.230143 0.229908 0.241401
chargesum: 0.00000
title: Mulliken charges with hydrogens summed into heavy atoms:
elementType: Br Br O O C C C C C C C C C C C
charge: 0.019047 0.031347 -0.263622 -0.256757 -0.048938 0.226434 0.224775 0.447370 -0.070245 -0.072671 -0.044520 0.186799 -0.137618 -0.140059 -0.101342
polarizability: 2.22340649e+02 -1.40899620e+01 1.50072996e+02 1.23302642e+01 2.55229371e+00 1.05447063e+02
1716.lowfreq: -8.7960 -4.4380 -3.2709 0.0003 0.0004 0.0005 14.4502 17.6729 22.1672
frequency: 14.3533 16.7213 22.0177 26.7603 56.1144 73.3058 102.7785 112.0124 141.5663 188.3495 219.0094 277.5589 297.0426 312.4767 341.2771 371.8747 406.0419 444.1515 480.2401 496.8357 518.2293 596.6414 632.8933 645.7903 680.0544 733.7480 739.6988 799.2791 846.1283 855.7158 860.4247 940.3622 969.8970 983.8526 988.3184 995.0568 1010.9795 1032.9741 1047.0974 1055.3742 1066.3752 1124.6022 1125.1456 1188.0176 1212.7503 1224.2341 1234.0625 1248.7960 1290.3803 1307.3862 1309.1655 1374.8601 1376.9474 1397.5363 1412.5754 1421.3111 1435.1767 1469.0398 1473.3394 1502.2733 1574.6212 1621.2368 1622.2259 2977.8050 3002.2944 3038.0926 3060.1515 3090.9559 3095.1063 3109.6249 3130.4089 3130.6658 3133.3923 3160.9004 3176.4712
redmass: 1.1546 5.7178 5.3777 6.0972 6.6702 9.0085 5.4674 7.6158 3.7209 7.3182 4.9514 4.5880 3.7635 3.8454 4.0695 3.0487 2.8563 4.6551 3.0575 4.5009 3.4460 5.4568 6.9551 5.4420 4.6105 4.7984 3.0564 5.1749 1.5564 1.5250 1.2520 6.7860 1.8164 1.3399 1.4244 1.3801 3.3304 3.7063 1.6172 5.0593 2.5751 1.2994 1.1939 1.1401 1.2511 3.0559 1.1621 3.6936 1.1381 1.2189 1.2730 1.4282 3.5389 1.2209 3.5891 1.0940 1.0946 1.1050 1.0572 2.6519 6.5232 6.3878 10.0939 1.0392 1.0625 1.0578 1.0942 1.1001 1.0905 1.0991 1.0892 1.1060 1.0901 1.0957 1.0951
irintensity: 0.6713 0.8385 0.6768 0.2422 1.0571 1.2912 0.4526 0.5090 3.3170 0.4951 2.1914 1.3483 11.4054 4.7432 2.5256 26.5130 0.1137 17.1024 6.9598 2.4377 12.7766 1.5431 1.8437 28.4722 24.0927 8.3185 23.7737 6.3189 32.7731 16.6225 0.4641 1.1021 18.3612 3.9848 3.4228 0.6606 75.7641 69.9170 38.3864 247.8073 9.6751 4.9526 10.0583 92.7320 35.8562 1.7081 16.4343 311.6404 23.0832 31.3359 2.5349 3.0443 7.6184 14.6893 10.8295 1.6864 38.9438 15.6103 13.6867 10.5552 24.2199 126.7284 154.3813 23.9100 23.6885 15.1608 20.0231 15.5163 1.6147 2.9446 14.2265 3.8954 14.6104 7.5404 2.2871
temp: 298.150 k
press: 1.00000 atm
elementType: 35 35 8 8 6 6 6 6 6 6 6 6 6 6 6 1 1 1 1 1 1 1 1 1 1 1 1
symmnumber: 1
zpe: 535035.4 jmol-1
zpe.correction: 0.203784 hartree
zpe.thermalcorrener: 0.219885 hartree
zpe.thermalcorrenthalpy: 0.220829 hartree
zpe.thermalcorrgfe: 0.153523 hartree
zpe.sumelectzpe: -602.635515 hartree
zpe.sumelectthermal: -602.619415 hartree
zpe.sumelectthermalent: -602.618471 hartree
zpe.sumelectthermalfe: -602.685776 hartree
dipole: -3.5043 0.1644 2.0313
dipole: 4.0538
quadrupole: -89.0395 -109.6150 -103.7920
quadrupole: -3.8967 11.1165 0.5736
quadrupole: 11.7760 -8.7995 -2.9765 -3.8967 11.1165 0.5736
hfenergy: -602.8392994 hartree
pointgroup: C01 [X(C11H12Br2O2)]
dipole: 1.3167364 0.2292781 0.8702608 debye
polarizability: 224.597024|-11.0951234|144.0260101|-0.429457|-14.5558968|109.2376746 unknown
InChI: InChI=1S/C11H12Br2O2/c1-8-2-4-9(5-3-8)11(14)15-7-10(13)6-12/h2-5,10H,6-7H2,1H3
charge 0 multiplicity 1
27 atoms
Br -3.155023 -2.322117 0.027213
Br -5.801263 -0.145445 -1.360192
O  -0.928968 -0.119386 1.065226
O  -0.763813 1.782046 -0.280581
C  -3.229071 -0.290232 0.10704
C  -2.351833 0.204248 1.273211
C  1.196088 0.360319 0.0585
C  3.928885 -0.350908 -0.33695
C  -4.670463 0.185708 0.277815
C  2.054497 1.204476 -0.694023
C  1.706879 -0.844541 0.608576
C  -0.218389 0.770257 0.228744
C  3.402393 0.849532 -0.886421
C  3.057114 -1.190352 0.407583
C  5.389292 -0.716552 -0.522962
H  -2.812007 0.034915 -0.858234
H  -2.618236 -0.291228 2.219642
H  -2.462529 1.302888 1.359634
H  -4.696599 1.28093 0.410686
H  -5.189921 -0.320199 1.105415
H  1.644871 2.126461 -1.119851
H  1.039619 -1.498741 1.176596
H  4.057406 1.506137 -1.471022
H  3.443252 -2.125634 0.829431
H  5.539348 -1.809922 -0.505498
H  5.787125 -0.328621 -1.476826
H  6.007849 -0.287038 0.289248
