program: Gaussian 09
title: 000238888
version: EM64L-G09RevD.01
frameworkgroup: C1[X(C11H14Cl3O4P)]
method: RPBEPBE
basis: SDD
operation: Freq
keyword: #p
keyword: freq=noraman
keyword: PBEPBE/SDD
title: #p freq=noraman PBEPBE/SDD
converged: YES YES NO NO
title: Mulliken charges:
elementType: Cl Cl Cl P O O O O C C C C C C C C C C C H H H H H H H H H H H H H H
charge: -0.065324 -0.069147 -0.055976 1.271891 -0.485110 -0.529979 -0.377983 -0.621606 -0.630444 0.682853 -0.358559 -0.332194 -0.198494 -0.184463 -0.214818 -0.245802 -0.217650 -0.554136 -0.557587 0.300288 0.282369 0.245516 0.234912 0.238647 0.258620 0.366253 0.259295 0.238510 0.239377 0.256942 0.289148 0.277298 0.257350
chargesum: 0.00000
title: Mulliken charges with hydrogens summed into heavy atoms:
elementType: Cl Cl Cl P O O O O C C C C C C C C C C C
charge: -0.065324 -0.069147 -0.055976 1.271891 -0.485110 -0.529979 -0.011730 -0.621606 -0.330157 0.682853 -0.358559 -0.049824 0.281934 0.312804 0.044477 -0.007292 0.021726 -0.008045 -0.022939
polarizability: 2.15135357e+02 1.92094314e+01 1.53094295e+02 -9.27072975e+00 -7.22256206e+00 1.66148914e+02
1716.lowfreq: -7.3934 0.0025 0.0029 0.0031 3.8811 5.8456 13.6403 18.0052 20.5408
frequency: 13.3324 17.9309 20.3054 24.1376 38.5441 45.5496 64.0520 76.2602 89.2694 102.5572 138.4466 149.2484 160.7883 170.9259 184.2108 207.8265 242.4520 253.7162 265.4654 310.0318 329.5384 345.1592 356.6441 369.7497 390.5802 408.4783 434.7962 458.6571 500.6655 538.1928 589.7264 603.1261 608.5159 636.9346 669.0092 675.2916 695.1501 742.0671 766.6848 818.6159 859.0029 860.4678 872.3747 938.1766 944.8182 954.4393 965.9816 984.4688 990.7850 992.8731 1015.9609 1036.7663 1043.7005 1080.2014 1080.7015 1124.3716 1170.6391 1174.1314 1174.7258 1202.6736 1225.1581 1225.3350 1227.5768 1249.1080 1293.1755 1297.9749 1300.5107 1366.9953 1368.9857 1374.9740 1389.8630 1426.5589 1427.4338 1430.4573 1450.7502 1464.7586 1465.5970 1575.9340 1607.1453 2973.3863 2983.7752 3043.0503 3055.2899 3063.0847 3064.9916 3104.5992 3119.6196 3144.9278 3144.9498 3149.8734 3163.8321 3177.8138 3540.1139
redmass: 8.1198 12.9763 9.4489 9.8036 6.9118 6.0794 6.7708 8.1361 4.6338 5.9143 6.3626 5.0209 6.5206 6.8718 4.7715 4.7445 2.5331 4.5847 4.0157 5.3356 3.1207 2.7502 2.3057 4.7913 6.2844 4.4259 3.9397 3.5201 6.5776 4.2186 5.6338 5.2433 5.0736 5.4453 4.9765 6.0182 5.2767 3.1387 1.4120 4.1233 2.4371 2.3614 1.4394 2.3345 2.2927 1.5336 3.9386 2.0675 1.3767 1.8640 5.9239 7.8542 2.3672 2.5093 2.6020 1.7445 1.1772 1.2032 1.0806 1.7633 1.1678 1.1482 1.2405 1.6593 1.3584 1.1888 1.1848 1.2888 1.5038 1.7348 1.7763 1.1034 2.1730 1.1029 1.0816 1.0788 2.3778 5.9798 6.8861 1.0573 1.0587 1.1016 1.0798 1.0615 1.0819 1.0857 1.0904 1.0885 1.1092 1.1098 1.0945 1.0996 1.0662
irintensity: 1.0110 0.2310 2.4954 1.0117 2.1415 3.4920 0.4080 1.5418 6.2153 0.3354 15.7772 6.3736 8.8785 11.7188 3.3936 1.1259 3.3335 15.3277 4.0017 10.0487 20.1411 80.1483 76.3505 20.3074 17.3147 17.6137 8.0497 30.4306 36.7165 2.7712 66.0890 12.3120 29.2461 55.5731 76.8564 16.6616 32.0853 22.2764 77.2526 24.1576 92.3596 58.4973 5.2269 75.1084 119.9157 22.4006 74.0187 76.3254 3.7672 74.3890 41.0787 95.9952 17.4180 33.9168 39.0517 5.0208 1.9442 2.9379 4.8438 13.6293 13.0659 16.7295 31.7613 3.2675 9.0770 15.5906 10.8439 4.5412 9.0814 10.2288 14.0102 12.4376 23.3074 13.3519 14.6778 10.7100 30.2130 9.7152 5.8668 31.7111 27.9828 4.8398 7.9645 25.1999 13.7350 7.5745 0.6257 3.0408 8.5081 6.1901 9.9613 11.8579 23.9462
temp: 298.150 k
press: 1.00000 atm
elementType: 17 17 17 15 8 8 8 8 6 6 6 6 6 6 6 6 6 6 6 1 1 1 1 1 1 1 1 1 1 1 1 1 1
symmnumber: 1
zpe: 621325.4 jmol-1
zpe.correction: 0.236650 hartree
zpe.thermalcorrener: 0.258549 hartree
zpe.thermalcorrenthalpy: 0.259493 hartree
zpe.thermalcorrgfe: 0.179876 hartree
zpe.sumelectzpe: -2448.387496 hartree
zpe.sumelectthermal: -2448.365598 hartree
zpe.sumelectthermalent: -2448.364654 hartree
zpe.sumelectthermalfe: -2448.444271 hartree
dipole: 0.4895 -0.2164 2.2280
dipole: 2.2914
quadrupole: -125.3620 -138.7936 -144.0729
quadrupole: 4.5591 -12.3485 -0.9653
quadrupole: 10.7142 -2.7175 -7.9967 4.5591 -12.3485 -0.9653
hfenergy: -2448.6241468 hartree
pointgroup: C01 [X(C11H14Cl3O4P1)]
dipole: 0.1558997 -0.2690545 -0.8461931 debye
polarizability: 213.2061181|-19.0476293|152.4389675|14.9326861|-1.3610982|168.7334812 unknown
InChI: InChI=1S/C11H14Cl3O4P/c12-5-7-17-19(16,18-8-6-13)11(15)9-3-1-2-4-10(9)14/h1-4,11,15H,5-8H2
charge 0 multiplicity 1
33 atoms
Cl 1.624269 0.04271 -3.05804
Cl -5.016341 -0.56598 -0.363317
Cl 0.792665 -3.30129 0.935264
P  -1.013086 0.831485 0.622402
O  -2.526344 1.540448 0.125181
O  -1.108156 -0.818117 0.085969
O  0.443671 2.943216 -0.335134
O  -0.778401 1.082175 2.177064
C  0.362378 1.504295 -0.542084
C  1.663311 0.760691 -0.32788
C  2.343572 0.094519 -1.373858
C  2.270629 0.752153 0.958452
C  -3.068823 1.292394 -1.225005
C  -1.631841 -1.85758 1.001234
C  3.58009 -0.547905 -1.179944
C  3.509544 0.117286 1.174923
C  4.166412 -0.531439 0.104674
C  -4.572949 1.114763 -1.105326
C  -1.052568 -3.189196 0.564092
H  0.00109 1.380488 -1.572681
H  1.73754 1.210329 1.801337
H  -2.602856 0.406326 -1.697489
H  -2.865101 2.190879 -1.842547
H  -2.735328 -1.886188 0.899394
H  -1.364228 -1.613108 2.045898
H  0.829566 3.133277 0.559847
H  4.071899 -1.05409 -2.015242
H  3.952927 0.114085 2.175643
H  5.126861 -1.032606 0.263464
H  -5.060126 1.139213 -2.092539
H  -5.010289 1.86135 -0.42734
H  -1.149586 -3.336902 -0.521095
H  -1.521701 -4.018475 1.116281
