program: Gaussian 09
title: 000238835
version: EM64L-G09RevD.01
frameworkgroup: C1[X(C16H28O4)]
method: RPBEPBE
basis: SDD
operation: Freq
keyword: #pfreq=noraman
keyword: PBEPBE/SDD
title: #p freq=noraman PBEPBE/SDD
converged: YES YES NO NO
title: Mulliken charges:
elementType: O O O O C C C C C C C C C C C C C C C C H H H H H H H H H H H H H H H H H H H H H H H H H H H H
charge: -0.267145 -0.267143 -0.247575 -0.247573 0.021895 0.021903 -0.459207 -0.445741 -0.459210 -0.445735 -0.382606 -0.382607 0.260366 0.260354 -0.487885 -0.487892 -0.349979 -0.349966 -0.683337 -0.683340 0.216463 0.216465 0.202745 0.201104 0.210092 0.203706 0.202745 0.201103 0.210095 0.203702 0.236079 0.220566 0.220567 0.236080 0.230198 0.240876 0.230212 0.240875 0.208926 0.229159 0.208929 0.229150 0.222703 0.209862 0.208731 0.222703 0.209859 0.208730
chargesum: 0.00000
title: Mulliken charges with hydrogens summed into heavy atoms:
elementType: O O O O C C C C C C C C C C C C C C C C
charge: -0.267145 -0.267143 -0.247575 -0.247573 0.238358 0.238368 -0.055359 -0.031943 -0.055361 -0.031938 0.074040 0.074039 0.260366 0.260354 -0.016810 -0.016805 0.088106 0.088113 -0.042042 -0.042048
polarizability: 2.05499211e+02 -1.16068607e-03 1.95027780e+02 1.20133711e-01 -2.47717378e-04 1.53542377e+02
1716.lowfreq: -7.3080 -0.0002 0.0001 0.0007 6.6426 7.3342 16.9742 27.1071 28.3559
frequency: 16.9654 26.7561 28.1692 33.0295 37.6760 47.7236 49.0770 55.3702 81.2912 84.0562 89.7757 141.8570 165.2172 173.9243 206.4794 222.6641 228.9866 236.7348 241.2348 241.8384 282.8809 307.2888 312.2397 335.3777 352.4794 388.3198 411.0328 435.8158 442.6386 506.1143 508.1266 551.4416 562.0618 583.0794 664.5106 666.8086 739.3343 739.4103 767.5206 783.7737 823.7178 829.2796 836.4054 867.8455 868.7900 887.0705 891.0132 891.1538 915.4088 936.9829 945.1465 949.9483 979.0683 1003.3673 1032.4797 1056.7799 1056.8633 1060.9532 1073.8743 1085.7483 1087.3572 1109.4143 1109.6044 1112.4713 1119.1679 1138.0853 1138.3352 1154.4389 1160.5745 1210.5593 1212.0736 1221.2547 1221.4397 1240.4399 1245.6155 1272.4492 1275.4077 1276.9364 1280.4065 1286.6662 1298.7631 1298.9026 1313.9539 1320.7799 1340.8728 1342.8764 1351.3863 1352.3193 1361.9002 1364.9808 1365.8145 1373.5065 1394.0750 1394.0863 1443.1606 1443.1871 1455.0878 1456.5351 1460.8099 1461.0462 1469.7934 1474.3067 1475.3809 1475.4087 1480.5656 1480.5692 1486.7345 1486.7466 1642.4090 1642.4417 2956.5139 2959.6613 2962.8664 2964.4046 2973.6226 2973.6828 2974.5864 2974.9344 2978.2936 2978.3015 2999.4967 2999.5023 3007.4726 3007.7409 3016.8860 3027.3559 3036.6281 3040.8295 3040.8458 3044.2110 3058.9685 3058.9926 3076.3183 3076.3418 3079.6436 3079.6944 3081.2224 3081.2314
redmass: 3.9297 3.7166 4.9080 4.7921 4.7520 2.2448 1.9257 2.5953 2.7868 4.0002 2.8632 4.4981 3.8442 3.1602 4.5279 2.0503 4.4444 2.1590 1.0784 1.1496 3.7843 3.2913 2.6639 3.6062 3.4377 1.7767 2.8305 2.3012 2.8929 4.4709 4.1587 2.7138 3.0912 2.3071 4.5852 4.6203 1.1745 1.1747 2.7899 1.4954 4.6291 2.7891 3.2300 1.3649 1.3786 2.2268 2.1659 1.5464 1.5053 2.0981 3.2503 2.9573 1.7343 2.1941 3.1425 2.3860 2.3851 1.0950 1.9424 1.9193 1.8534 2.3259 2.3949 2.5869 3.0125 2.4276 2.5448 2.6926 2.2455 1.2918 1.2983 1.3350 1.3331 1.1804 1.2282 1.2189 1.2549 1.2314 1.2625 1.2087 1.2880 1.2985 1.3140 1.2754 1.3880 1.4137 1.4715 1.4842 1.6384 1.5228 1.5249 1.5577 1.2150 1.2150 1.0853 1.0850 1.0930 1.0961 1.0901 1.0927 1.0831 1.0973 1.0520 1.0521 1.0443 1.0443 1.0775 1.0775 9.2439 9.2831 1.0660 1.0694 1.0708 1.0734 1.0372 1.0363 1.0628 1.0692 1.0651 1.0651 1.0618 1.0618 1.0571 1.0570 1.0979 1.1032 1.0969 1.0965 1.0965 1.1022 1.0974 1.0974 1.0992 1.0991 1.1012 1.1012 1.1079 1.1079
irintensity: 0.0306 0.4726 1.0789 2.9792 0.0242 0.5331 0.0861 0.2014 0.5628 1.5572 0.0748 0.9794 0.9568 5.1296 0.4649 0.2103 4.6348 1.6451 0.0144 0.1627 1.8722 17.7931 19.6144 2.1543 7.9142 0.5547 1.5788 0.0740 1.4136 1.2888 0.1577 0.8288 3.7604 8.8018 0.0002 10.4285 12.4661 12.7516 1.1200 0.1574 0.1740 5.0225 6.9967 0.1960 0.4488 1.0491 3.6787 6.5026 10.8745 15.0781 76.4908 84.4058 38.2031 18.4043 1.6154 6.9813 12.1712 3.7684 30.4624 103.8431 78.6300 6.7192 27.4970 11.2254 8.1910 210.9544 167.6827 67.7828 0.1964 5.9693 11.5124 3.6049 3.6418 1.3485 0.4933 2.9283 26.2933 16.5335 10.0672 1.9678 28.6112 44.0277 0.9179 3.5764 0.2015 0.8408 10.7310 13.0895 1.0315 9.9529 23.8443 0.6626 9.1974 8.3613 7.7834 30.7160 6.7246 3.5662 1.5569 13.3264 32.8173 1.2197 1.8923 7.6924 18.5336 7.5727 1.0155 31.0793 23.9390 274.3589 15.2335 24.6720 15.1295 18.1997 32.1411 40.5378 67.2388 4.6937 6.1278 6.8555 21.7122 28.4207 12.5327 57.5633 67.9314 39.8815 31.6907 1.2028 1.1097 63.0188 2.1857 2.0126 97.8095 2.7928 71.7831 53.8168 21.7222 47.0922
temp: 298.150 k
press: 1.00000 atm
elementType: 8 8 8 8 6 6 6 6 6 6 6 6 6 6 6 6 6 6 6 6 1 1 1 1 1 1 1 1 1 1 1 1 1 1 1 1 1 1 1 1 1 1 1 1 1 1 1 1
symmnumber: 1
zpe: 1093580.2 jmol-1
zpe.correction: 0.416523 hartree
zpe.thermalcorrener: 0.439793 hartree
zpe.thermalcorrenthalpy: 0.440738 hartree
zpe.thermalcorrgfe: 0.359187 hartree
zpe.sumelectzpe: -925.811098 hartree
zpe.sumelectthermal: -925.787827 hartree
zpe.sumelectthermalent: -925.786883 hartree
zpe.sumelectthermalfe: -925.868433 hartree
dipole: 0.0001 -0.9297 -0.0001
dipole: 0.9297
quadrupole: -120.4250 -110.6103 -132.5496
quadrupole: -0.0007 13.1046 0.0000
quadrupole: 0.7700 10.5846 -11.3546 -0.0007 13.1046 0.0000
hfenergy: -926.2276205 hartree
pointgroup: C01 [X(C16H28O4)]
dipole: -0.0000521 -0.3657816 0.0001648 debye
polarizability: 205.4983357|0.0012275|195.0277739|0.2447259|-0.0161643|153.5432582 unknown
InChI: InChI=1S/C16H28O4/c1-3-5-15(17)19-11-13-7-9-14(10-8-13)12-20-16(18)6-4-2/h13-14H,3-12H2,1-2H3
charge 0 multiplicity 1
48 atoms
O  3.707128 -0.675626 0.545908
O  -3.707281 -0.676073 -0.545437
O  3.932129 0.412707 -1.513006
O  -3.932319 0.413881 1.512612
C  1.469087 -1.748885 0.322983
C  -1.469298 -1.749162 -0.321578
C  0.748966 -3.023467 -0.190923
C  0.748922 -0.478216 -0.190242
C  -0.749171 -3.023346 0.193301
C  -0.749177 -0.478109 0.190742
C  2.947833 -1.792653 -0.092581
C  -2.948051 -1.792626 0.093963
C  4.127092 0.379767 -0.276219
C  -4.127292 0.37995 0.275855
C  4.823101 1.448579 0.551051
C  -4.82336 1.448067 -0.552272
C  5.8400 2.274262 -0.267132
C  -5.839792 2.274809 0.265403
C  6.434272 3.436062 0.555598
C  -6.434163 3.435846 -0.558333
H  1.42494 -1.750846 1.433141
H  -1.425113 -1.751944 -1.431733
H  0.842282 -3.074362 -1.296246
H  1.239897 -3.92987 0.216085
H  1.238013 0.424036 0.223113
H  0.85723 -0.422593 -1.293186
H  -0.842501 -3.073408 1.298661
H  -1.240077 -3.930065 -0.213031
H  -1.23831 0.423833 -0.223244
H  -0.857475 -0.421712 1.293649
H  3.061956 -1.715015 -1.189902
H  3.438807 -2.709603 0.27776
H  -3.439008 -2.709877 -0.275661
H  -3.062219 -1.714106 1.191215
H  4.036296 2.12164 0.951278
H  5.294864 0.971148 1.428235
H  -4.036553 2.12052 -0.953513
H  -5.295538 0.969814 -1.428789
H  6.651295 1.608647 -0.619614
H  5.340557 2.659813 -1.174622
H  -6.651073 1.609719 0.618903
H  -5.339948 2.661236 1.172301
H  7.168646 4.00864 -0.039267
H  6.950146 3.065756 1.461664
H  5.644409 4.138934 0.882143
H  -7.168215 4.009182 0.036199
H  -6.950442 3.064679 -1.463818
H  -5.644299 4.138236 -0.885914
