program: Gaussian 09
title: 000238800
version: EM64L-G09RevD.01
frameworkgroup: C1[X(C12H22N2O4)]
method: RPBEPBE
basis: SDD
operation: Freq
keyword: #p
keyword: freq=noraman
keyword: PBEPBE/SDD
title: #p freq=noraman PBEPBE/SDD
converged: YES YES NO NO
title: Mulliken charges:
elementType: O O O O N N C C C C C C C C C C C C H H H H H H H H H H H H H H H H H H H H H H
charge: -0.277677 -0.277761 -0.297553 -0.297530 -0.125098 -0.125053 -0.037281 -0.037278 -0.459520 -0.459536 -0.740124 -0.740137 0.331115 0.331079 -0.249797 -0.249874 -0.668242 -0.668183 0.208563 0.208568 0.256313 0.245511 0.256323 0.245564 0.224749 0.229164 0.214042 0.224747 0.229136 0.214070 0.234664 0.220842 0.234735 0.220827 0.214754 0.224114 0.251470 0.214754 0.224145 0.251395
chargesum: 0.00000
title: Mulliken charges with hydrogens summed into heavy atoms:
elementType: O O O O N N C C C C C C C C C C C C
charge: -0.277677 -0.277761 -0.297553 -0.297530 -0.125098 -0.125053 0.171282 0.171290 0.042304 0.042351 -0.072170 -0.072184 0.331115 0.331079 0.205708 0.205688 0.022096 0.022112
polarizability: 1.70792115e+02 -1.57684784e-03 1.65440701e+02 5.38092026e+00 -1.57997521e-02 1.34253820e+02
1716.lowfreq: -12.2498 -6.7871 -0.0006 0.0002 0.0005 6.0639 29.8452 31.1895 43.6159
frequency: 29.5628 31.1044 43.5820 53.6232 80.0340 83.0131 85.9847 100.8885 113.3743 115.3112 148.2053 190.1700 195.9483 202.0271 217.4592 225.1918 271.9483 296.9765 321.3754 326.4482 344.4620 359.9703 402.1334 408.6500 426.0279 439.5798 442.1303 510.9319 523.9148 593.9661 636.6510 673.6221 688.4134 721.9193 739.1761 751.8979 792.6178 809.5309 820.7648 839.1618 844.2735 895.4716 897.3365 946.5952 968.2483 997.0488 1006.1703 1009.4703 1029.1275 1053.9336 1060.2585 1093.7757 1095.7014 1111.9469 1122.9839 1140.1380 1144.7727 1155.3799 1156.0768 1192.5673 1220.4575 1246.1685 1279.0750 1280.8748 1281.8345 1291.9927 1317.6477 1333.6039 1340.0268 1342.3139 1347.7531 1353.2820 1386.3293 1386.4907 1391.3610 1393.0772 1393.9922 1395.3757 1455.3337 1456.7083 1459.8782 1462.9816 1462.9971 1464.8923 1476.0913 1477.0660 1482.7823 1483.5874 1485.5100 1485.5709 1625.6634 1629.9311 2977.3789 2978.8321 2979.1675 2982.7395 2989.6940 2989.7800 3006.3176 3007.0740 3027.7829 3028.3173 3071.7509 3073.6144 3076.0437 3077.4459 3084.7299 3084.8772 3090.8010 3090.8071 3096.1857 3096.3502 3116.9761 3117.0473
redmass: 3.6675 3.7465 2.8850 2.6138 5.7665 3.5038 5.1473 6.3079 2.9967 4.9232 2.6725 1.3598 1.5258 1.1058 1.2015 1.5713 2.3274 2.3735 3.4214 3.0682 3.5594 2.6629 4.8988 1.8156 3.5998 4.6368 3.7453 3.3998 4.4979 3.9174 4.9522 10.6427 10.9963 3.5178 2.7164 2.5700 1.4133 1.3055 2.4916 3.1686 2.5981 2.4324 1.8433 1.7941 1.7639 2.1159 2.4250 1.6596 1.8362 2.5668 3.6917 2.1528 2.1433 2.2931 4.3230 1.1942 2.4536 1.6609 1.6620 2.5919 1.3762 2.8620 1.5393 1.1111 1.4414 1.3034 1.4593 1.6514 1.3521 1.3333 1.3616 1.3735 1.2782 1.2985 2.3321 1.9220 1.2605 1.4776 1.1000 1.1110 1.0805 1.0511 1.0515 1.0810 1.0511 1.0447 1.0614 1.0567 1.0531 1.0531 8.9553 9.3518 1.0795 1.0389 1.0384 1.0787 1.0359 1.0359 1.0671 1.0694 1.0594 1.0596 1.0993 1.0987 1.0997 1.0992 1.0972 1.0971 1.1032 1.1032 1.0980 1.0978 1.1061 1.1061
irintensity: 0.2662 1.0854 0.4743 0.1516 2.4903 0.8530 2.5200 1.6283 0.9914 0.0616 0.5590 1.3067 0.6782 0.0916 2.0799 1.7169 4.3180 4.1111 25.8261 3.2741 2.4039 11.0705 3.2232 3.2566 14.9958 0.0005 0.5466 1.8141 3.9409 3.4440 6.8613 17.0056 8.6643 0.2928 20.6811 8.6988 11.9167 0.0973 2.0492 14.4865 0.2842 10.2141 0.5354 11.6390 11.0336 24.9481 14.7678 1.1939 7.2059 251.5749 93.0155 12.0563 41.8248 118.0941 51.8479 1.1368 69.2740 18.8478 30.7601 59.1531 89.3908 240.6794 1.3324 4.7586 11.5428 3.9536 1.9271 82.6549 5.1952 0.4337 24.4595 1.4256 84.0148 26.3922 134.9038 105.8723 23.6176 2.0074 54.4339 37.7801 13.3192 17.3681 18.1137 1.3088 35.6188 18.2960 5.7975 6.4803 14.2446 18.2012 559.7071 35.8309 17.1806 0.5664 34.9171 32.4630 41.5263 0.4240 90.2966 20.6601 1.3364 60.5961 2.2102 90.9948 3.7030 58.1221 18.2921 60.4237 1.2372 1.0987 7.9602 2.1584 12.2960 49.7183
temp: 298.150 k
press: 1.00000 atm
elementType: 8 8 8 8 7 7 6 6 6 6 6 6 6 6 6 6 6 6 1 1 1 1 1 1 1 1 1 1 1 1 1 1 1 1 1 1 1 1 1 1
symmnumber: 1
zpe: 884718.5 jmol-1
zpe.correction: 0.336971 hartree
zpe.thermalcorrener: 0.357379 hartree
zpe.thermalcorrenthalpy: 0.358323 hartree
zpe.thermalcorrgfe: 0.286771 hartree
zpe.sumelectzpe: -879.429215 hartree
zpe.sumelectthermal: -879.408807 hartree
zpe.sumelectthermalent: -879.407863 hartree
zpe.sumelectthermalfe: -879.479415 hartree
dipole: 0.0055 0.9711 -0.0001
dipole: 0.9712
quadrupole: -108.9522 -92.0227 -114.7056
quadrupole: 0.0605 -12.5120 0.0454
quadrupole: -3.7254 13.2041 -9.4787 0.0605 -12.5120 0.0454
hfenergy: -879.7661865 hartree
pointgroup: C01 [X(C12H22N2O4)]
dipole: 0.3820792 -0.0012022 -0.0003458 debye
polarizability: 165.4407229|-0.0098391|171.1094433|-0.0052221|4.1543222|133.9364697 unknown
InChI: InChI=1S/C12H22N2O4/c1-5-17-11(15)13-7-9(3)10(4)8-14(13)12(16)18-6-2/h9-10H,5-8H2,1-4H3
charge 0 multiplicity 1
40 atoms
O  -1.677774 -1.353999 -0.779937
O  -1.675099 1.359164 0.781242
O  -0.777107 -2.648371 0.971267
O  -0.772145 2.651228 -0.970462
N  0.12258 -0.564208 0.419506
N  0.123862 0.565718 -0.417812
C  2.606863 -0.618995 0.484277
C  2.608224 0.613031 -0.48515
C  1.291448 -0.659529 1.3180
C  1.29208 0.657532 -1.317535
C  2.831341 -1.952498 -0.266637
C  2.837463 1.945844 0.265556
C  -0.778617 -1.61023 0.256777
C  -0.773887 1.61452 -0.253904
C  -2.701248 -2.416252 -1.002868
C  -2.697888 2.422446 1.002487
C  -2.156527 -3.523649 -1.909403
C  -2.153892 3.528774 1.910755
H  3.440239 -0.480233 1.20355
H  3.440428 0.471759 -1.205288
H  1.201697 -1.60579 1.875352
H  1.250391 0.17865 2.038565
H  1.204613 1.604067 -1.874784
H  1.24778 -0.180515 -2.038058
H  2.900341 -2.798323 0.441142
H  2.002059 -2.174245 -0.963141
H  3.767249 -1.920852 -0.854501
H  2.908188 2.791496 -0.442253
H  2.009602 2.169997 0.962978
H  3.773914 1.911409 0.852398
H  -3.01124 -2.81876 -0.022539
H  -3.535786 -1.870573 -1.471895
H  -3.005355 2.82579 0.021708
H  -3.534037 1.877471 1.469459
H  -2.958035 -4.252742 -2.132264
H  -1.794467 -3.107034 -2.865475
H  -1.330945 -4.060347 -1.412587
H  -2.955085 4.258636 2.132222
H  -1.794397 3.111284 2.867415
H  -1.32663 4.06483 1.416038
