program: Gaussian 09
title: 000238777
version: EM64L-G09RevD.01
frameworkgroup: C1[X(C15H15NO2)]
method: RPBEPBE
basis: SDD
operation: Freq
keyword: #p
keyword: freq=noraman
keyword: PBEPBE/SDD
title: #p freq=noraman PBEPBE/SDD
converged: YES YES NO NO
title: Mulliken charges:
elementType: O O N C C C C C C C C C C C C C C C H H H H H H H H H H H H H H H
charge: -0.283084 -0.284998 -0.086267 0.491645 0.221267 0.216489 -0.506324 -0.427151 -0.311278 -0.391827 0.264419 -0.378224 -0.353546 -0.203527 -0.219583 -0.251061 -0.493527 -0.536190 0.253014 0.274179 0.239222 0.218210 0.250174 0.239976 0.225626 0.223427 0.226931 0.229531 0.230489 0.224549 0.226952 0.227249 0.243242
chargesum: 0.00000
title: Mulliken charges with hydrogens summed into heavy atoms:
elementType: O O N C C C C C C C C C C C C C C C
charge: -0.283084 -0.284998 -0.086267 0.491645 0.221267 0.216489 -0.253310 -0.152972 -0.072057 -0.173617 0.264419 -0.128050 -0.113571 0.022098 0.003844 -0.024130 0.191041 0.161252
polarizability: 3.86584767e+02 -3.82119655e+00 1.69860565e+02 3.45082787e+00 9.78347970e+00 8.98593830e+01
1716.lowfreq: -62.3907 -9.2234 -5.6585 0.0005 0.0005 0.0008 1.6557 31.4708 37.7588
frequency: -62.3893 31.4505 37.7324 50.7908 82.0023 117.9098 140.8614 157.4626 195.9117 198.3474 228.2179 245.4672 259.3400 272.4983 307.3262 342.6799 374.1268 409.2291 444.0382 459.5729 473.0817 506.1705 522.6775 607.7513 608.3673 613.4931 631.7435 695.4815 702.1483 726.2267 750.6728 771.2496 812.5851 834.7218 839.4316 881.9258 894.0816 912.4564 953.4593 967.7680 979.0036 981.1269 987.1187 988.6134 1009.7222 1020.6821 1079.1094 1103.9820 1107.7437 1111.2084 1145.9407 1154.1210 1164.7210 1170.5256 1182.1895 1194.9803 1216.3464 1256.0060 1296.1973 1308.5658 1344.6032 1376.0573 1392.0569 1403.6725 1437.2264 1438.2911 1448.1798 1456.7837 1463.4972 1467.6603 1472.8088 1475.1471 1500.6242 1566.2541 1576.1969 1591.2810 1614.3043 1618.5209 2943.4868 2963.8855 2996.9515 3054.0254 3103.9207 3120.3046 3120.8793 3124.1476 3130.0406 3141.9456 3143.1653 3153.3824 3155.2281 3167.9104 3174.8027
redmass: 3.0560 3.8370 4.8857 4.9689 3.5757 4.9595 3.3118 3.8228 1.2302 3.5196 5.1640 1.3071 3.2631 3.2040 3.6635 4.2978 3.9880 2.9067 5.3255 3.3578 5.0839 6.8189 3.3264 4.7689 4.9218 5.9047 5.7131 1.8410 5.5790 3.2835 4.0230 2.0916 1.4081 2.5017 1.7559 1.4945 3.6066 1.6718 1.3358 1.3965 2.3512 8.1828 1.7316 1.8186 3.7397 2.1162 1.5273 2.0931 1.2511 1.2567 1.4356 1.4479 1.3562 1.1874 1.3111 2.3451 2.0126 2.0507 2.0656 1.4357 2.0763 6.1593 5.0405 2.3308 1.8376 1.4179 1.3370 1.0531 1.0493 1.0525 1.3923 1.5801 2.8403 8.0126 5.9811 6.2828 6.6678 6.4899 1.0860 1.0325 1.0285 1.1043 1.1049 1.1049 1.0848 1.0999 1.0873 1.0935 1.0912 1.0869 1.0957 1.1006 1.0963
irintensity: 8.6101 1.5185 0.9043 1.6675 2.7205 6.4232 0.1970 2.8748 2.3611 1.0859 1.6551 0.1171 7.5765 1.4644 6.9855 6.1520 2.5546 1.7394 13.1699 4.7874 5.8543 12.1115 9.5754 25.2261 7.5588 3.1908 3.1968 46.2606 13.8570 8.0665 18.4889 40.5712 37.2586 13.6786 1.6578 20.1530 23.7496 15.0185 0.5543 0.9608 14.9458 66.7313 7.6525 3.9956 41.0201 16.2890 10.1269 108.3999 1.9645 0.2522 3.0180 21.0873 8.5236 3.6020 7.0635 41.2646 109.7497 290.6192 186.1045 41.2980 18.4046 2.3388 33.2081 20.5256 11.2155 0.4558 5.7889 12.3214 39.1394 15.2616 31.9387 87.5941 150.5631 290.6276 7.2644 73.4972 32.8589 24.7023 55.2578 80.0930 86.8452 41.5090 39.6649 28.0624 7.6359 25.0660 1.8667 23.8676 5.3083 7.7604 33.4938 27.3497 8.1107
temp: 298.150 k
press: 1.00000 atm
elementType: 8 8 7 6 6 6 6 6 6 6 6 6 6 6 6 6 6 6 1 1 1 1 1 1 1 1 1 1 1 1 1 1 1
symmnumber: 1
zpe: 685792.8 jmol-1
zpe.correction: 0.261205 hartree
zpe.thermalcorrener: 0.277221 hartree
zpe.thermalcorrenthalpy: 0.278165 hartree
zpe.thermalcorrgfe: 0.216595 hartree
zpe.sumelectzpe: -784.456713 hartree
zpe.sumelectthermal: -784.440697 hartree
zpe.sumelectthermalent: -784.439753 hartree
zpe.sumelectthermalfe: -784.501323 hartree
dipole: 3.4089 -0.9586 0.2305
dipole: 3.5486
quadrupole: -76.9415 -95.5734 -109.4372
quadrupole: -10.7311 1.8327 2.3534
quadrupole: 17.0425 -1.5894 -15.4532 -10.7311 1.8327 2.3534
hfenergy: -784.717918 hartree
pointgroup: C01 [X(C15H15N1O2)]
dipole: -1.3505669 -0.3349103 0.1139042 debye
polarizability: 386.5562141|-3.4780829|146.0315393|-5.2226564|-37.804392|113.7169617 unknown
InChI: InChI=1S/C15H15NO2/c1-17-14-9-8-12(10-15(14)18-2)11-16-13-6-4-3-5-7-13/h3-11H,1-2H3
charge 0 multiplicity 1
33 atoms
O  -3.50764 2.10757 -0.502892
O  -4.645753 -0.463056 0.392182
N  1.903331 -0.483336 0.308693
C  -0.441467 0.152917 0.11685
C  -2.762329 0.982462 -0.12834
C  -3.250645 -0.290241 0.314066
C  -1.366291 1.174443 -0.216074
C  -0.937976 -1.103286 0.555379
C  -2.322977 -1.312484 0.650562
C  0.999581 0.416778 0.001211
C  3.288983 -0.238276 0.115657
C  4.19483 -0.832443 1.037759
C  3.812419 0.511346 -0.979353
C  5.584612 -0.644555 0.897257
C  5.205666 0.680923 -1.122692
C  6.098582 0.113923 -0.182663
C  -4.97935 2.1429 -0.465392
C  -5.148709 -1.762704 0.843475
H  -1.019441 2.156923 -0.555977
H  -0.222919 -1.889515 0.813507
H  -2.692065 -2.284296 0.991274
H  1.276101 1.437523 -0.341424
H  3.781033 -1.428389 1.857613
H  3.13014 0.924721 -1.731679
H  6.2695 -1.097698 1.622915
H  5.597406 1.247771 -1.975242
H  7.17969 0.247157 -0.299233
H  -5.359777 1.974593 0.555675
H  -5.417133 1.39447 -1.146239
H  -5.227105 3.161202 -0.804015
H  -4.811982 -1.989298 1.873383
H  -4.834361 -2.575262 0.160587
H  -6.244255 -1.665183 0.824572
