program: Gaussian 09
title: 000238823
version: EM64L-G09RevD.01
frameworkgroup: C1[X(C19H28O3)]
method: RPBEPBE
basis: SDD
operation: Freq
keyword: #pfreq=noraman
keyword: PBEPBE/SDD
title: #p freq=noraman PBEPBE/SDD
converged: YES YES NO NO
title: Mulliken charges:
elementType: O O O C C C C C C C C C C C C C C C C C C C H H H H H H H H H H H H H H H H H H H H H H H H H H H H
charge: -0.283405 -0.273420 -0.283354 -0.232091 -0.038311 0.585352 -0.575927 -0.304809 -0.410600 -0.323576 -0.339990 -0.507784 -0.360269 0.443303 -0.697257 -0.196031 -0.361261 -0.402688 -0.676818 -0.263753 -0.249005 -0.242651 0.211392 0.229223 0.227545 0.223366 0.229503 0.206148 0.245949 0.209656 0.198962 0.214701 0.189556 0.181791 0.203814 0.196911 0.200549 0.215995 0.209208 0.208995 0.188728 0.190992 0.242875 0.225595 0.205074 0.229437 0.228108 0.224750 0.226393 0.229130
chargesum: 0.00000
title: Mulliken charges with hydrogens summed into heavy atoms:
elementType: O O O C C C C C C C C C C C C C C C C C C C
charge: -0.283405 -0.273420 -0.283354 -0.020699 0.190912 0.585352 -0.125016 0.130842 0.045005 0.090087 0.031357 -0.303970 0.037191 0.443303 -0.063060 0.183689 -0.118386 -0.177092 -0.014199 -0.039002 -0.022611 -0.013522
polarizability: 3.24933030e+02 2.96648710e+01 2.17873900e+02 1.62662024e+01 -1.08511672e+01 1.48628588e+02
1716.lowfreq: -21.6626 -11.8802 -0.0010 -0.0007 -0.0005 2.1711 4.7018 14.3502 19.4496
frequency: -21.3962 13.3952 18.9428 22.8173 32.5676 40.0190 57.8969 67.9707 79.3407 93.6679 98.4156 109.8479 123.2447 142.1761 168.6084 181.4336 200.2359 207.8492 233.6674 236.1486 256.3941 285.5637 310.0718 316.1424 344.0791 384.2457 409.2139 419.6076 439.4016 485.1299 521.3450 557.1187 613.9451 618.7991 639.2261 672.1135 680.6683 700.8201 725.0501 760.3321 767.1096 799.2664 814.6728 829.8183 837.9288 844.0423 848.2781 856.3408 872.0277 900.6142 907.0589 916.4099 927.8718 937.2798 958.4498 976.1976 986.9566 990.9947 994.7973 995.9718 1006.9311 1018.6805 1030.8169 1044.3849 1073.2768 1075.6007 1082.7865 1091.0525 1093.7953 1109.8032 1110.7720 1134.7359 1150.2365 1155.7125 1172.8183 1186.5526 1196.7939 1209.9242 1212.6126 1229.1074 1237.5840 1242.2730 1251.2999 1262.7641 1280.6816 1283.5715 1291.0561 1294.7600 1304.3446 1326.8666 1333.8545 1337.3183 1344.7378 1350.4791 1369.0181 1375.2557 1386.9992 1390.7044 1407.3459 1412.4317 1442.2178 1459.4856 1463.5377 1470.6801 1473.3667 1477.0722 1478.7804 1479.7682 1484.3363 1484.9975 1487.3887 1494.1370 1495.0327 1581.1733 1610.5445 1654.7587 2922.2111 2937.5659 2946.2698 2951.5401 2968.0794 2970.8232 2971.1047 2977.4180 2977.9736 2985.8491 2991.9787 2995.0990 2997.5838 3004.9479 3021.2309 3030.8429 3057.5401 3061.3161 3067.4562 3070.2404 3089.1804 3093.2273 3101.7303 3116.0527 3127.5909 3141.0403 3160.6857 3194.1110
redmass: 2.6570 3.7438 3.3716 3.3207 3.2640 2.8825 1.9050 2.0361 4.2822 3.3597 3.3084 4.4776 3.8740 3.6514 2.5433 3.5009 4.6081 5.0336 1.1475 1.1620 3.4380 2.8086 4.2670 3.0144 4.2648 3.7764 2.8349 2.9721 2.7845 2.8632 3.0068 5.4440 5.7880 4.6478 4.3672 3.2689 9.3861 1.6695 1.0689 1.1875 1.7659 5.3208 1.0871 3.2251 3.0814 1.4840 1.3410 3.0606 2.5753 2.0897 1.5476 2.0626 2.7151 1.7334 1.2408 1.4078 4.6664 3.3734 1.3294 4.0147 3.7415 4.4363 2.2516 3.1709 5.0812 2.3861 1.5378 1.6345 1.6825 2.1091 2.2386 1.2727 1.3206 2.1509 1.0613 1.9023 1.1159 1.3214 1.5498 2.3355 1.2822 1.1323 1.1451 1.2928 1.1587 1.0524 1.1678 1.2685 1.2455 1.4246 1.2556 1.3728 1.5686 1.6188 1.6235 3.6222 1.2165 1.2837 1.5631 1.8221 1.9557 1.0409 1.0714 1.0733 1.0792 1.0438 1.1595 1.1264 1.2271 1.1189 1.3872 1.0818 1.1117 5.6245 6.0330 7.2927 1.0552 1.0557 1.0592 1.0861 1.0566 1.0386 1.1065 1.0877 1.0631 1.0736 1.0827 1.0358 1.0839 1.0815 1.1002 1.0998 1.1022 1.0873 1.1007 1.0993 1.1039 1.0991 1.1010 1.0867 1.0873 1.0937 1.0997 1.0928
irintensity: 1.3013 0.1470 0.2958 0.0289 0.2163 1.5019 0.0219 3.4977 1.5574 0.8884 1.5678 4.3028 0.9414 3.1531 0.8255 2.0060 3.6787 0.9956 0.0478 0.7137 1.7352 3.5474 1.9111 0.6535 1.8335 5.5696 0.5021 0.6547 5.1330 2.2346 17.9203 10.1500 1.1310 2.8004 4.0893 2.1221 6.2824 53.6989 9.9300 2.7103 19.5392 29.9792 3.8892 67.3588 14.1645 11.0382 5.7736 13.3007 27.3133 5.9138 4.8539 5.7866 22.0066 18.0040 5.2541 0.3057 3.6990 3.9831 0.2442 4.7906 67.4093 206.5823 63.9925 11.2767 232.2289 0.4425 10.3763 7.3219 16.1607 8.7420 15.1188 4.8901 4.4068 6.2071 0.9405 24.8826 1.5848 3.3443 27.9823 1.3667 7.2729 15.4313 0.1512 1.2463 9.8365 1.7539 1.8637 4.9438 0.0773 5.3056 19.1137 1.3038 46.4347 1.3391 39.0792 1.6687 11.0703 30.4055 3.4701 2.3955 10.3978 11.5246 0.0835 4.4711 11.7723 11.4751 0.1141 8.9081 5.7063 6.7022 18.6692 1.1663 29.5553 0.7286 4.7796 2.9278 50.4418 63.4215 21.3898 60.3733 50.6284 31.0105 57.8147 25.8008 2.6521 28.6487 31.2099 24.1458 49.8957 90.1447 23.0131 0.3146 34.4425 24.0332 108.0803 54.7539 33.2606 36.3395 36.6954 9.2071 0.1143 32.8182 41.6983 7.3733
temp: 298.150 k
press: 1.00000 atm
elementType: 8 8 8 6 6 6 6 6 6 6 6 6 6 6 6 6 6 6 6 6 6 6 1 1 1 1 1 1 1 1 1 1 1 1 1 1 1 1 1 1 1 1 1 1 1 1 1 1 1 1
symmnumber: 1
zpe: 1124892.3 jmol-1
zpe.correction: 0.428449 hartree
zpe.thermalcorrener: 0.451777 hartree
zpe.thermalcorrenthalpy: 0.452721 hartree
zpe.thermalcorrgfe: 0.371069 hartree
zpe.sumelectzpe: -964.734032 hartree
zpe.sumelectthermal: -964.710704 hartree
zpe.sumelectthermalent: -964.709760 hartree
zpe.sumelectthermalfe: -964.791412 hartree
dipole: 1.6909 -0.0028 -1.4369
dipole: 2.2190
quadrupole: -110.7422 -128.2541 -138.5620
quadrupole: 1.5930 -4.4193 -4.7388
quadrupole: 15.1106 -2.4013 -12.7092 1.5930 -4.4193 -4.7388
hfenergy: -965.1624807 hartree
pointgroup: C01 [X(C19H28O3)]
dipole: -0.634164 -0.0886808 0.593393 debye
polarizability: 324.9180754|-31.9967572|213.0532916|1.7374081|23.4235186|153.4641517 unknown
InChI: InChI=1S/C19H28O3/c1-3-5-7-12-17(13-16-10-8-6-9-11-16)19-21-15-18(22-19)14-20-4-2/h6,8-11,13,18-19H,3-5,7,12,14-15H2,1-2H3
charge 0 multiplicity 1
50 atoms
O  -1.632468 -1.388479 0.238164
O  -1.383024 0.142527 -1.540372
O  -5.239048 -0.627876 0.410082
C  -0.727646 -1.015358 -0.863077
C  -2.995444 -1.095485 -0.266329
C  0.634443 -0.642626 -0.319199
C  0.6607 0.547018 0.620166
C  -2.794189 0.205086 -1.077956
C  0.976763 1.895331 -0.09128
C  -3.915373 -0.963849 0.942843
C  1.005286 3.085557 0.892841
C  1.688766 -1.420079 -0.725794
C  1.303414 4.435606 0.201148
C  3.125524 -1.392001 -0.387026
C  1.325404 5.624885 1.185607
C  -6.252853 -0.49737 1.468982
C  3.800583 -0.335444 0.294977
C  3.906567 -2.517878 -0.790062
C  -7.577876 -0.143168 0.796124
C  5.181058 -0.41789 0.573057
C  5.285088 -2.601127 -0.511678
C  5.932238 -1.548762 0.1771
H  -0.669775 -1.847204 -1.59822
H  -3.338244 -1.919913 -0.924568
H  -0.334138 0.630893 1.097957
H  1.387677 0.377411 1.437654
H  -3.453126 0.268482 -1.958576
H  -2.927748 1.101207 -0.443054
H  0.210774 2.061199 -0.871441
H  1.948575 1.82588 -0.620173
H  -3.540167 -0.163052 1.617378
H  -3.947253 -1.918265 1.51024
H  0.029462 3.151816 1.418756
H  1.767887 2.902838 1.680334
H  1.430136 -2.246119 -1.408785
H  2.278598 4.368238 -0.322959
H  0.541908 4.616005 -0.584468
H  1.542282 6.577181 0.667376
H  0.350442 5.733117 1.697721
H  2.097675 5.480751 1.965084
H  -5.94381 0.294602 2.187113
H  -6.331199 -1.455945 2.028789
H  3.258702 0.564117 0.591862
H  3.4131 -3.339506 -1.3246
H  -8.378209 -0.038949 1.55108
H  -7.870207 -0.931221 0.081037
H  -7.489207 0.808789 0.244844
H  5.675856 0.409162 1.095081
H  5.854509 -3.480842 -0.832031
H  7.004591 -1.60549 0.394353
