program: Gaussian 09
title: 000238770
version: EM64L-G09RevD.01
frameworkgroup: C1[X(C9H11NO5)]
method: RPBEPBE
basis: SDD
operation: Freq
keyword: #p
keyword: freq=noraman
keyword: PBEPBE/SDD
title: #p freq=noraman PBEPBE/SDD
converged: YES YES NO NO
title: Mulliken charges:
elementType: O O O O O N C C C C C C C C C H H H H H H H H H H H
charge: -0.284237 -0.292593 -0.276796 -0.220617 -0.207938 0.014172 0.053673 0.339076 0.309134 0.455768 -0.542853 -0.540631 -0.518992 -0.530959 -0.496743 0.299392 0.309473 0.212106 0.273898 0.235273 0.230859 0.237368 0.246270 0.208035 0.253082 0.234780
chargesum: 0.00000
title: Mulliken charges with hydrogens summed into heavy atoms:
elementType: O O O O O N C C C C C C C C C
charge: -0.284237 -0.292593 -0.276796 -0.220617 -0.207938 0.014172 0.053673 0.339076 0.309134 0.455768 -0.243462 -0.231158 0.202285 0.183538 0.199153
polarizability: 1.93806633e+02 1.31052139e+00 1.57225433e+02 -1.01544395e+00 1.31620626e+00 6.41324764e+01
1716.lowfreq: -5.9272 -3.0956 -0.0008 -0.0003 0.0007 8.0115 42.8118 58.3928 71.6394
frequency: 42.8069 58.3919 71.6342 83.1334 96.0772 143.5833 154.1498 162.6574 185.4817 199.0658 219.5064 230.8067 271.2030 299.5705 305.4916 336.1599 362.0809 424.0718 438.1972 495.0418 538.4845 547.1973 579.1764 643.9348 696.8946 706.5279 731.4825 762.9442 861.1467 864.7383 890.9976 907.3150 945.0087 995.4538 1072.2277 1080.2020 1107.0998 1107.8913 1112.8667 1147.3226 1153.6342 1160.1580 1190.3636 1203.0993 1215.3419 1289.5229 1362.4698 1393.7913 1411.6385 1417.6536 1440.5934 1449.5750 1452.2832 1457.9243 1463.7629 1467.7217 1469.9131 1477.2496 1482.3177 1584.8118 1602.8156 2973.1018 2979.8977 2983.8483 3067.0107 3095.5625 3096.0354 3131.4565 3133.0460 3138.4191 3195.1815 3199.1767
redmass: 3.0782 8.6995 4.1205 2.0366 3.0880 1.6391 4.4279 2.9712 1.6955 2.3772 2.1773 2.7325 1.8267 4.0642 4.4768 9.0335 5.2003 6.6390 6.3115 6.9986 7.0732 5.0171 4.6029 5.4443 5.3329 5.8489 7.4129 4.9981 3.3866 1.9860 8.7055 1.5661 8.8734 8.3863 3.3656 2.0764 1.2439 1.2401 1.2565 1.3511 1.4292 1.5219 3.1517 1.9701 5.2352 5.1303 9.3352 5.6370 1.9917 1.4366 1.2072 1.3189 1.2535 1.4110 1.5807 1.0499 1.0892 1.1853 1.0631 7.0291 8.9940 1.0322 1.0354 1.0341 1.1046 1.0965 1.0972 1.1058 1.1009 1.1056 1.0912 1.0926
irintensity: 3.5825 0.3738 4.5117 3.5126 1.6792 0.9138 3.3117 14.1443 3.2315 1.9363 1.8975 4.6542 0.4311 8.1478 1.5711 1.0233 4.3781 11.8941 5.0730 0.8798 4.5276 1.8691 5.3178 5.3469 26.0280 19.6973 7.5907 6.5359 13.4593 11.5405 1.5317 51.0650 71.0170 8.3361 171.3751 113.9838 5.1264 26.9977 0.0393 0.9440 37.5092 58.5839 89.1292 133.6684 253.3726 291.6778 53.0238 44.1282 122.1815 51.8763 1.4838 71.9930 71.0331 41.5253 116.9732 14.1077 19.7104 25.9576 16.1682 35.3777 73.7019 49.9089 69.9820 78.1944 34.8900 23.8508 50.8988 17.3064 17.7022 9.2449 4.1400 9.3188
temp: 298.150 k
press: 1.00000 atm
elementType: 8 8 8 8 8 7 6 6 6 6 6 6 6 6 6 1 1 1 1 1 1 1 1 1 1 1
symmnumber: 1
zpe: 508517.0 jmol-1
zpe.correction: 0.193684 hartree
zpe.thermalcorrener: 0.209157 hartree
zpe.thermalcorrenthalpy: 0.210101 hartree
zpe.thermalcorrgfe: 0.150467 hartree
zpe.sumelectzpe: -779.153574 hartree
zpe.sumelectthermal: -779.138101 hartree
zpe.sumelectthermalent: -779.137157 hartree
zpe.sumelectthermalfe: -779.196791 hartree
dipole: 6.5163 3.3180 1.6037
dipole: 7.4862
quadrupole: -98.9504 -75.7766 -87.8870
quadrupole: -6.7077 6.2728 -1.5374
quadrupole: -11.4124 11.7614 -0.3490 -6.7077 6.2728 -1.5374
hfenergy: -779.3472579 hartree
pointgroup: C01 [X(C9H11N1O5)]
dipole: -2.9045954 -0.4878283 -0.0133997 debye
dipolederiv: -1.6385508 0.0341955 -0.1876731 -0.1352819 -0.3379292 -0.0524067 -0.5168784 0.0281894 -0.4073748 -0.5988269 -0.5044181 -0.05015 -0.4478865 -1.3706455 -0.0683657 -0.0366803 -0.0840538 -0.2865771 -0.5206565 0.4930064 -0.0951317 0.5902284 -1.3720763 0.213102 -0.1145166 0.3550347 -0.3791456 -0.6684778 0.1677122 -0.1439058 0.3500876 -0.7571737 0.1725904 -0.1907602 0.1297257 -0.307042 -0.9009554 -0.1825788 -0.1577072 -0.3463035 -0.5659648 -0.0427689 -0.1454957 -0.0047427 -0.2683758 1.9718002 -0.112652 0.5124928 -0.1227342 1.0732914 -0.1745751 0.5600597 -0.1607514 0.3572719 1.2055973 -0.245261 0.3663916 -0.2130078 -0.2517537 0.0312301 0.6286451 0.0210923 0.1089726 0.3453472 0.7932132 0.0271335 0.7880939 0.8413666 0.1720101 -0.1104632 0.1825715 0.0644744 -0.2653744 -0.2246553 0.01234 -0.67443 1.3753139 -0.3334902 0.1647625 -0.3579121 0.2000415 -0.8138243 0.2016657 -0.2628476 0.2542542 0.269653 0.0390157 -0.2916186 0.0274719 -0.0106793 -0.0332799 -0.3149159 0.0766875 0.1744284 -0.3012168 0.0572699 0.013522 -0.090002 -0.1876765 0.0819844 0.2264583 0.0361172 -0.2340451 -0.297192 -0.0611406 0.1058426 0.034581 -0.1297051 0.8609732 0.0300898 -0.0338708 0.3427012 0.1972332 0.0753857 -0.1843545 0.02372 0.303108 0.1783894 -0.147457 -0.0242118 0.1275865 0.8354584 0.0059451 -0.0385497 -0.0873672 0.3017191 0.5867194 -0.5016099 0.0515069 -0.2015421 0.5137293 -0.0193531 -0.0114509 -0.0398598 0.3044029 0.1420981 0.0395986 -0.013429 -0.0058714 0.0428429 0.0152267 0.0076356 0.0370959 0.1820993 0.1234848 -0.0443975 -0.0147986 -0.0116453 0.0964915 0.0066169 -0.0369571 0.0005364 0.1754585 -0.0392107 -0.0246076 -0.0283119 -0.0196243 0.0337519 -0.1120248 0.1771263 -0.0905091 -0.1117697 0.1031915 -0.0197141 0.0188938 -0.1241563 -0.0610682 0.0120244 0.05889 0.0124505 0.0902706 -0.1053538 0.0384569 -0.069125 0.0844862 0.082671 0.0556381 -0.0954138 0.0502949 0.0316613 0.0820974 0.1054612 -0.0675563 -0.0234377 -0.011192 -0.0162698 -0.0324053 0.0795181 -0.1249942 -0.0247041 0.1474421 0.116198 -0.0159858 -0.0075967 -0.0006611 0.0942522 -0.0032434 -0.0030644 -0.0297274 -0.1380827 -0.0417673 -0.078019 -0.0127935 -0.0167597 -0.0439773 -0.031212 0.1123012 -0.0536286 0.1176384 0.0552192 -0.041787 0.0631583 0.089665 0.1140708 0.0058718 -0.1150684 -0.0496133 0.0876781 -0.0837864 -0.0532176 0.109747 -0.072553 -0.079248 -0.0378183 -0.0216472 0.0605009 -0.0222664 0.0012921 0.037109 -0.1881059 0.0246488 0.0039627 -0.0006822 0.1213385 unknown
polarizability: 183.9633569|-6.0041146|158.3649151|30.3491905|-11.4335792|72.8362704 unknown
InChI: InChI=1S/C9H11NO5/c1-13-7-4-6(10(11)12)5-8(14-2)9(7)15-3/h4-5H,1-3H3
charge 0 multiplicity 1
26 atoms
O  -2.335328 0.598881 -1.041619
O  -1.575458 -2.00754 -0.369799
O  -0.423741 2.755697 -0.673692
O  3.278536 -1.594213 1.111487
O  3.753219 0.627748 0.903275
N  2.945102 -0.376866 0.820179
C  -1.078731 0.336897 -0.48869
C  -0.632347 -0.990727 -0.171516
C  -0.15812 1.423632 -0.361669
C  1.560496 -0.127913 0.367347
C  0.682203 -1.229244 0.267234
C  1.169945 1.18367 0.061211
C  -3.544579 0.109478 -0.337388
C  -1.132532 -3.392383 -0.158092
C  -1.787764 3.312931 -0.591836
H  1.056745 -2.22432 0.51252
H  1.868243 2.01712 0.156862
H  -3.594526 0.544875 0.679259
H  -3.5439 -0.989324 -0.282625
H  -4.386717 0.471814 -0.945627
H  -0.837976 -3.56129 0.894867
H  -0.290122 -3.64441 -0.828959
H  -2.006791 -4.011305 -0.405957
H  -2.268824 3.045248 0.367838
H  -2.409537 2.965025 -1.430255
H  -1.634395 4.402018 -0.640756
