program: Gaussian 09
title: 000238751
version: EM64L-G09RevD.01
frameworkgroup: C1[X(C10H6Cl3N3)]
method: RPBEPBE
basis: SDD
operation: Freq
keyword: #p
keyword: freq=noraman
keyword: PBEPBE/SDD
title: #p freq=noraman PBEPBE/SDD
converged: NO NO NO NO
title: Mulliken charges:
elementType: Cl Cl Cl N N N C C C C C C C C C C H H H H H H
charge: -0.010410 -0.004761 -0.007981 -0.454099 -0.092428 0.039209 0.495064 -0.463109 -0.324738 0.281096 -0.031774 -0.186223 -0.121309 -0.304866 -0.136262 -0.343212 0.317946 0.251751 0.327028 0.258407 0.253859 0.256810
chargesum: 0.00000
title: Mulliken charges with hydrogens summed into heavy atoms:
elementType: Cl Cl Cl N N N C C C C C C C C C C
charge: -0.010410 -0.004761 -0.007981 -0.136154 -0.092428 0.039209 0.495064 -0.211357 0.002290 0.281096 -0.031774 0.072185 -0.121309 -0.051006 -0.136262 -0.086402
polarizability: 3.15695459e+02 -2.36975035e+00 1.57664233e+02 -3.99990737e-03 1.71489764e-02 5.70891665e+01
1716.lowfreq: -0.3813 -0.0014 0.0011 0.0012 2.6249 9.9330 31.1683 36.7947 76.2122
frequency: 31.0132 36.7649 76.2080 104.3280 158.2705 169.5224 183.3389 183.9785 208.3221 217.0675 316.0692 325.5207 374.3180 393.0561 429.8183 433.9575 440.7861 479.2167 566.4579 606.5313 632.3566 645.4371 651.5676 692.6734 696.0040 748.0940 761.3962 826.4975 837.7907 855.3709 861.2697 919.4954 939.5868 939.7533 986.3653 997.0038 1075.3047 1122.3983 1142.1080 1217.5277 1225.8680 1246.8035 1273.1563 1299.9016 1346.9001 1384.5852 1395.7327 1430.5304 1456.8875 1474.2282 1546.0910 1553.1395 1596.1023 1605.1453 3135.8219 3165.3767 3165.7222 3171.0899 3201.1903 3532.7953
redmass: 14.2214 6.8721 11.6240 7.0669 5.4118 23.9796 13.5356 10.3341 14.7325 5.6101 9.8839 5.3956 8.1142 14.3708 7.0674 2.7398 3.0503 9.9385 3.0368 3.5674 8.2075 2.0237 7.1158 3.0799 8.0088 3.6871 8.6773 6.6807 1.3317 1.6305 1.6322 8.2797 5.2248 1.4367 1.3032 5.2604 2.3719 2.2209 1.3338 3.1296 2.4295 2.1258 2.2215 3.8010 2.4666 2.2383 3.7143 2.3232 3.6321 4.0321 4.6695 7.3387 2.6066 6.8673 1.0925 1.0912 1.0940 1.0932 1.0953 1.0757
irintensity: 0.0977 2.8104 1.6585 0.5014 1.4734 0.3886 0.8264 0.0940 0.0643 0.2862 2.1876 0.4089 11.5459 8.2059 3.3554 3.2973 18.7285 29.3357 31.0418 10.5439 7.7869 31.5742 9.3680 2.2706 21.4740 0.0792 43.8117 16.6663 15.9583 32.0828 82.9698 6.3069 71.2113 5.0061 3.0460 26.1459 149.7378 63.1462 4.0594 13.2171 34.5024 10.3962 9.4916 28.7592 40.9158 34.8976 5.8541 52.6575 213.1433 203.7255 80.3771 1173.6963 257.2558 32.5874 4.8291 0.7044 6.0985 8.8480 19.4265 24.3755
temp: 298.150 k
press: 1.00000 atm
elementType: 17 17 17 7 7 7 6 6 6 6 6 6 6 6 6 6 1 1 1 1 1 1
symmnumber: 1
zpe: 373770.9 jmol-1
zpe.correction: 0.142362 hartree
zpe.thermalcorrener: 0.156293 hartree
zpe.thermalcorrenthalpy: 0.157237 hartree
zpe.thermalcorrgfe: 0.099281 hartree
zpe.sumelectzpe: -1927.976370 hartree
zpe.sumelectthermal: -1927.962439 hartree
zpe.sumelectthermalent: -1927.961495 hartree
zpe.sumelectthermalfe: -1928.019451 hartree
dipole: 0.0910 -1.6966 -0.0029
dipole: 1.6990
quadrupole: -147.2414 -102.1342 -115.7651
quadrupole: -6.6032 -0.0034 -0.0009
quadrupole: -25.5278 19.5793 5.9485 -6.6032 -0.0034 -0.0009
hfenergy: -1928.1187317 hartree
pointgroup: C01 [X(C10H6Cl3N3)]
dipole: -0.0079655 -0.6682332 0.0144304 debye
dipolederiv: -0.4811316 0.2949028 -0.0016362 0.4174521 -0.375462 0.0027588 -0.0039469 0.0038525 -0.0348209 -0.8226869 -0.2317762 0.0113495 -0.3079124 -0.153989 0.005103 0.012888 0.0044663 -0.0272138 -0.8645362 -0.3749168 0.01496 -0.4982296 -0.3600535 0.0105359 0.0176561 0.0094942 -0.0715254 -2.4628099 0.0196686 0.0179102 0.335626 -0.2142632 -0.0052096 0.0113565 -0.0024573 -0.3309974 -1.0142374 0.059409 0.005938 0.8132295 -0.5651903 0.0009481 -0.0099871 0.007522 -0.188249 -0.8766372 -0.1330967 0.0091559 -0.2037755 -1.0221716 0.0204738 0.0107747 0.0196831 -0.1514635 1.5942146 0.2003477 -0.0169519 0.652283 0.1536082 -0.0064456 -0.0264683 -0.002538 0.1055639 -0.5529789 0.0358625 0.002734 0.1699605 -0.1006022 -0.0027209 0.0002578 -0.0016013 -0.1616611 -0.3306571 0.0075447 0.0013216 -0.2599293 -0.0894243 0.0008981 0.0067502 -0.0015505 -0.1632302 2.4803633 -0.2345719 -0.0147181 -0.9004296 0.444643 0.0024643 -0.0018728 -0.0032586 0.2009698 0.6155238 -0.5283268 0.004384 -0.6815757 0.5997409 -0.0057354 0.0070555 -0.0070236 -0.020184 -0.0784168 -0.1404235 0.0026381 0.0511221 0.0602584 -0.0029604 -0.0008529 -0.0013797 -0.0726544 0.8335075 0.5398504 -0.018225 0.4975337 -0.022052 -0.0055122 -0.0174522 -0.0059098 -0.0800615 -1.5225234 -0.0605791 0.0132592 -0.2423192 -0.1467727 0.0022956 0.0172231 0.0007233 -0.1401666 1.8444843 0.4539453 -0.0254929 0.4076454 1.0694174 -0.0257068 -0.0248925 -0.0259922 0.0390887 0.9751966 0.0985904 -0.0107576 -0.1955075 0.6660379 -0.0128835 -0.004358 -0.0153675 -0.0184054 0.1392087 -0.0063373 0.0015645 -0.0600104 0.1294145 0.0040552 0.0031336 0.0035853 0.3053031 0.0628742 -0.0667304 0.0023003 -0.0649745 -0.0321517 0.0045302 0.0023564 0.004569 0.175122 0.2306623 0.0417214 -0.0011745 0.0536986 0.0793822 0.0013129 -0.0012783 0.0014992 0.1728996 0.067144 -0.0167145 0.001105 -0.034771 -0.0241035 0.003775 0.0014103 0.0036578 0.1581529 0.0927334 0.0466331 -0.0001924 0.0271355 -0.0396401 0.0044388 0.0003403 0.0042475 0.1820302 0.0707026 -0.0050025 0.0005281 0.0237483 -0.0566265 0.0035848 -0.0000935 0.0037781 0.1215032 unknown
polarizability: 315.2044242|8.8896884|158.0921019|-2.4368467|-2.0949505|57.152332 unknown
InChI: InChI=1S/C10H6Cl3N3/c11-7-2-1-6(3-8(7)12)16-10-4-9(13)14-5-15-10/h1-5,16H
charge 0 multiplicity 1
22 atoms
Cl 4.643189 -1.992576 0.013631
Cl 5.288158 1.243767 -0.053334
Cl -5.574327 -1.404471 0.094586
N  -0.402172 -0.857283 0.037237
N  -1.759207 1.117559 0.007652
N  -4.1893 0.928256 0.032613
C  0.903839 -0.299039 0.014678
C  1.983957 -1.223375 0.022695
C  1.180077 1.094863 -0.014356
C  -1.650687 -0.253034 0.035521
C  3.311463 -0.763916 0.002198
C  2.517813 1.535117 -0.034532
C  3.589379 0.619303 -0.026521
C  -2.81901 -1.083869 0.063227
C  -4.04888 -0.417803 0.059966
C  -3.019423 1.627787 0.007675
H  -0.426774 -1.8793 0.058064
H  1.800355 -2.303736 0.044933
H  0.352268 1.803611 -0.020691
H  2.735786 2.607046 -0.056943
H  -2.758365 -2.175102 0.085699
H  -3.105136 2.717891 -0.014699
