program: Gaussian 09
title: 000238853
version: EM64L-G09RevD.01
frameworkgroup: C1[X(C16H18N6O2S)]
method: RPBEPBE
basis: SDD
operation: Freq
keyword: #p
keyword: freq=noraman
keyword: PBEPBE/SDD
title: #p freq=noraman PBEPBE/SDD
converged: YES YES NO NO
title: Mulliken charges:
elementType: S O O N N N N N N C C C C C C C C C C C C C C C C H H H H H H H H H H H H H H H H H H
charge: 0.280878 -0.212498 -0.212449 -0.168787 -0.047601 -0.060918 -0.096893 -0.590828 0.025122 -0.380039 -0.349244 -0.339707 0.165573 0.083793 -0.236887 -0.309785 -0.691278 -0.886096 -0.041592 0.567583 -0.318326 -0.393090 -0.355196 -0.351849 0.377935 0.212095 0.239256 0.205110 0.228555 0.194908 0.200235 0.267197 0.220091 0.215387 0.213725 0.280205 0.313891 0.276465 0.245068 0.283625 0.285475 0.331605 0.329283
chargesum: 0.00000
title: Mulliken charges with hydrogens summed into heavy atoms:
elementType: S O O N N N N N N C C C C C C C C C C C C C C C C
charge: 0.280878 -0.212498 -0.212449 -0.168787 -0.047601 -0.060918 -0.096893 0.070060 0.025122 0.071312 0.084421 0.055436 0.165573 0.083793 0.030311 -0.309785 -0.042074 -0.291999 -0.041592 0.567583 -0.041860 -0.148023 -0.071571 -0.066373 0.377935
polarizability: 3.80093385e+02 2.15828993e+00 2.23479735e+02 -1.86259458e+00 2.46635692e+01 1.93658807e+02
1716.lowfreq: -8.6096 -2.8774 -0.0011 -0.0003 0.0010 3.9963 7.6181 12.9585 21.8453
frequency: -2.9489 12.7390 21.8423 24.5273 40.3866 53.5019 68.5671 72.5185 99.4751 104.7409 116.4163 140.6606 158.0016 178.9515 197.7490 206.6576 229.5636 234.1310 254.2892 296.1891 306.7858 339.4198 351.0665 358.2662 375.7072 407.5350 409.8776 430.8471 444.4900 486.3954 505.9491 506.0419 508.7870 549.6162 588.2306 606.1111 624.4373 634.9444 642.6173 645.9695 674.0317 713.0198 727.8667 735.2915 746.8468 761.4682 779.9964 787.8060 798.3673 815.8601 819.9573 851.3676 866.2037 875.6936 893.5280 901.6639 925.4841 964.2658 987.7372 1003.4343 1006.8199 1016.3141 1037.5513 1074.8591 1077.0718 1092.2025 1105.3440 1114.5249 1123.9320 1179.7757 1181.0449 1194.9849 1198.4432 1219.9272 1223.9279 1252.0429 1257.2694 1272.5919 1287.5475 1291.0478 1302.0772 1307.5073 1323.4138 1342.0874 1348.5703 1361.5475 1363.6297 1380.1716 1391.5048 1404.5848 1422.2792 1434.1467 1441.9496 1462.9178 1469.0301 1476.5381 1477.5769 1480.3006 1487.6903 1501.9020 1520.2844 1575.4816 1594.9404 1606.3199 1609.5197 2966.0754 2976.7436 2984.9301 3006.9449 3011.1211 3022.0992 3043.3085 3071.1812 3077.3879 3078.3379 3110.8650 3139.8598 3149.4375 3181.3804 3183.7620 3228.4336 3566.6448 3724.1406
redmass: 2.8630 6.6639 6.1967 5.5932 5.7029 1.8240 7.0101 8.5195 2.4410 6.5048 5.2815 7.4075 5.3621 5.5403 5.6269 2.0370 1.4954 4.1012 4.5354 5.4252 5.6240 4.4326 2.6520 4.3499 6.1695 3.1915 5.9350 3.6270 1.1913 4.2053 2.2202 3.1144 2.1869 5.1688 8.0299 5.6925 6.9535 4.9608 6.4305 5.4488 4.3450 11.1781 3.8685 1.2042 4.7440 6.9628 4.6983 1.2703 7.9074 1.6926 5.7354 1.3305 1.6241 5.5671 1.8421 1.7344 1.2582 4.9267 1.3569 1.3746 2.9720 3.8017 2.3279 2.3948 2.1222 3.2470 1.3188 2.3734 4.0586 1.2150 1.1806 2.0440 1.8605 3.6183 4.8413 1.2097 1.4899 1.2946 3.0440 1.1027 1.3190 4.1441 2.6201 1.6499 2.0042 1.5916 7.6145 6.1800 1.2179 8.6308 3.2603 2.8589 1.1494 1.2776 1.0714 1.0581 1.0653 2.4581 1.0928 3.0224 7.7031 9.5689 7.6845 2.3501 2.5413 1.0591 1.0368 1.0601 1.0651 1.0934 1.0606 1.1024 1.1028 1.1010 1.1027 1.1043 1.0906 1.0910 1.0944 1.0956 1.0982 1.0442 1.1058
irintensity: 0.0860 0.4286 0.3461 0.1510 0.4359 0.2729 0.0799 2.1195 0.2407 1.9128 1.9015 4.7650 5.6452 0.1341 0.1995 0.8347 0.5243 0.7520 0.2733 3.0804 2.9868 8.8027 12.5949 2.3898 3.3564 0.1863 0.4569 0.3373 280.4620 8.6801 4.6243 3.6506 6.0266 6.6325 0.5199 3.5046 0.3332 10.8363 9.1473 11.0291 33.6188 7.2434 17.4384 8.5773 5.5701 34.1081 17.5384 0.6656 1.5600 9.4779 1.4222 8.9827 35.1765 100.6040 29.5234 7.2591 4.1050 20.9029 1.5927 0.4425 4.0267 3.1174 7.8584 1.8186 2.4255 21.5706 17.8857 17.7034 79.0418 51.6559 22.9962 28.1965 31.0653 250.4814 148.8666 6.6866 8.0027 0.9165 18.1506 1.0971 2.9479 65.8331 2.4946 12.7690 3.7885 39.0087 105.9759 72.2190 10.3305 0.7326 41.7062 45.4758 37.1194 25.7196 0.7495 5.7882 14.5529 12.2818 14.1430 229.7554 296.5226 213.2366 1.3060 205.6357 278.6612 30.7020 28.8803 21.5496 51.4876 14.4227 36.0027 6.9048 10.1582 53.2912 76.8614 9.9745 9.5146 0.4247 0.1174 2.1728 0.0702 113.7176 45.4687
temp: 298.150 k
press: 1.00000 atm
elementType: 16 8 8 7 7 7 7 7 7 6 6 6 6 6 6 6 6 6 6 6 6 6 6 6 6 1 1 1 1 1 1 1 1 1 1 1 1 1 1 1 1 1 1
symmnumber: 1
zpe: 865377.0 jmol-1
zpe.correction: 0.329605 hartree
zpe.thermalcorrener: 0.352502 hartree
zpe.thermalcorrenthalpy: 0.353446 hartree
zpe.thermalcorrgfe: 0.273825 hartree
zpe.sumelectzpe: -1495.652441 hartree
zpe.sumelectthermal: -1495.629543 hartree
zpe.sumelectthermalent: -1495.628599 hartree
zpe.sumelectthermalfe: -1495.708220 hartree
dipole: -7.4248 -1.5623 3.8036
dipole: 8.4874
quadrupole: -159.0906 -164.5041 -146.2393
quadrupole: -31.7382 9.9641 0.9466
quadrupole: -2.4792 -7.8927 10.3720 -31.7382 9.9641 0.9466
hfenergy: -1495.9820453 hartree
pointgroup: C01 [X(C16H18N6O2S1)]
dipole: -2.9354272 -1.4627934 -0.6275409 debye
polarizability: 379.3757075|-2.5015506|188.9253435|10.1266313|-21.2729082|228.9308754 unknown
InChI: InChI=1S/C16H18N6O2S/c1-2-3-8-21-10-18-13-14(21)19-16(17)20-15(13)25-9-11-4-6-12(7-5-11)22(23)24/h4-7,10H,2-3,8-9,17H2,1H3
charge 0 multiplicity 1
43 atoms
S  0.678626 0.406771 -2.41355
O  5.142637 0.434936 3.476643
O  6.790835 0.871325 1.961154
N  -4.190716 0.584736 -1.114773
N  -2.430195 1.583367 -2.215262
N  -3.045666 -1.422948 -0.241562
N  -0.670137 -1.473185 -0.887839
N  -1.630201 -3.187038 0.390918
N  5.589374 0.504896 2.265732
C  -5.534532 0.385755 -0.541266
C  -5.637328 0.873037 0.921573
C  -7.048736 0.644635 1.508684
C  -3.091413 -0.249958 -0.923605
C  -2.006632 0.382137 -1.615318
C  -3.730335 1.668029 -1.891166
C  -0.767361 -0.301988 -1.562149
C  -7.15802 1.115697 2.974628
C  1.985544 -0.94097 -2.047839
C  -1.796749 -1.988939 -0.267438
C  2.923574 -0.554852 -0.931246
C  2.485173 -0.607826 0.421278
C  4.25463 -0.144886 -1.208505
C  3.351071 -0.262357 1.473171
C  5.136708 0.206588 -0.168197
C  4.66994 0.141468 1.162332
H  -6.260708 0.92059 -1.181121
H  -5.764129 -0.6941 -0.594109
H  -5.380837 1.949862 0.970408
H  -4.887866 0.332879 1.531042
H  -7.799275 1.179244 0.890904
H  -7.301669 -0.43333 1.446836
H  -4.393593 2.478003 -2.18877
H  -8.172566 0.944373 3.377626
H  -6.441539 0.573027 3.61898
H  -6.936717 2.195818 3.062798
H  2.507352 -1.088277 -3.005564
H  1.387026 -1.831904 -1.791213
H  1.456337 -0.919508 0.630077
H  4.600746 -0.099461 -2.247269
H  3.034578 -0.297595 2.518872
H  6.164382 0.524494 -0.362475
H  -2.427621 -3.609222 0.857871
H  -0.723489 -3.644219 0.375707
