program: Gaussian 09
title: 000238791
version: EM64L-G09RevD.01
frameworkgroup: C1[X(C20H22O6)]
method: RPBEPBE
basis: SDD
operation: Freq
keyword: #pfreq=noraman
keyword: PBEPBE/SDD
title: #p freq=noraman PBEPBE/SDD
converged: YES YES NO NO
title: Mulliken charges:
elementType: O O O O O O C C C C C C C C C C C C C C C C C C C C H H H H H H H H H H H H H H H H H H H H H H
charge: -0.271695 -0.285526 -0.290290 -0.281588 -0.241559 -0.232967 0.267283 0.276751 0.014858 0.017037 -0.488044 -0.524464 0.357473 0.364747 0.247404 0.245877 -0.542611 -0.514943 0.083344 0.089677 -0.795232 -0.795572 -0.513634 -0.515630 -0.533985 -0.535450 0.272525 0.275568 0.294112 0.256792 0.239486 0.244268 0.257480 0.234597 0.234252 0.262504 0.261471 0.236048 0.218429 0.223012 0.231058 0.258329 0.229117 0.232715 0.241256 0.226865 0.221756 0.247098
chargesum: 0.00000
title: Mulliken charges with hydrogens summed into heavy atoms:
elementType: O O O O O O C C C C C C C C C C C C C C C C C C C C
charge: -0.271695 -0.285526 -0.290290 -0.281588 -0.241559 -0.232967 0.267283 0.276751 0.014858 0.017037 -0.215519 -0.248896 0.357473 0.364747 0.247404 0.245877 -0.248499 -0.258151 0.083344 0.089677 -0.053997 -0.064220 0.202314 0.196769 0.169103 0.160269
polarizability: 3.42456411e+02 -1.34886464e+01 2.89019132e+02 1.11453418e+00 -1.20393097e-01 1.62103272e+02
1716.lowfreq: -7.5353 -6.4542 -1.8931 0.0005 0.0007 0.0008 20.9251 33.4790 39.4867
frequency: 20.8853 33.4583 39.4838 48.7649 51.9589 59.3359 60.8904 67.9111 82.2741 94.2202 104.8634 119.5921 135.9000 138.0134 141.5134 147.8305 152.0200 163.9141 168.6745 191.9469 209.1860 213.8133 226.4529 247.5779 260.5747 271.6386 288.2439 294.3917 308.9614 316.4758 326.3961 342.9084 388.1484 414.5474 438.5105 454.8617 493.6441 506.5610 524.3463 529.2288 535.1536 544.1762 567.6841 586.4247 626.9535 649.6703 661.2712 667.1958 672.0649 708.0838 726.2120 770.8492 782.4539 853.2299 869.1918 875.8487 888.5013 896.0731 904.8266 931.6228 950.3316 953.3925 956.9929 965.6004 1004.0796 1023.7037 1024.4114 1062.8867 1087.6674 1094.9633 1107.7639 1109.0703 1111.6315 1112.3348 1134.9066 1149.3829 1153.1818 1157.7469 1165.2835 1189.4739 1214.4101 1227.0712 1239.5641 1256.6142 1287.4387 1331.7541 1363.8086 1368.6020 1376.4694 1387.3346 1394.3554 1412.6386 1420.3649 1432.2648 1439.8329 1443.7270 1445.9479 1448.6191 1451.3963 1455.6281 1458.5358 1461.0078 1462.9410 1465.2123 1467.1211 1470.2771 1475.2610 1476.8431 1480.1378 1483.6176 1560.8640 1565.5820 1582.5217 1594.0662 1600.7225 1611.1166 2961.1173 2968.5411 2982.5579 2984.9681 2985.4670 2986.5298 3050.1684 3059.7954 3067.0644 3070.6973 3092.5428 3097.4742 3124.0324 3124.4120 3126.1412 3127.3380 3131.0642 3139.0392 3159.2015 3167.6385 3174.9182 3179.3549
redmass: 5.2403 4.2483 3.7594 2.0769 3.8510 2.7963 3.9133 2.4993 2.5237 3.4151 3.8583 3.4019 1.0616 1.1003 2.2332 2.4429 2.3290 3.0585 2.7635 3.7700 3.1487 2.3119 1.8502 3.4780 2.2768 2.1718 2.7073 3.0756 4.6516 5.5276 5.7686 6.9414 5.0521 5.2178 4.5318 4.5144 5.2095 4.4659 3.9180 5.0834 4.2065 5.9053 4.2611 4.6961 4.6505 3.4460 3.0254 4.1054 5.1528 5.0353 5.5085 4.5052 4.2514 1.6157 6.6799 6.7434 2.0305 3.2272 1.4560 1.5196 8.2985 5.8539 2.2790 1.9931 5.1417 1.8460 1.8375 7.7723 2.1641 1.9838 1.2324 1.2347 1.2590 1.2588 2.2187 1.3575 1.4595 1.4656 1.9541 4.5440 1.9450 2.1499 1.8856 1.6811 4.8113 4.3854 1.3394 1.3339 4.3736 7.2053 3.2437 1.6196 1.2772 2.5219 1.3033 1.4487 1.1808 1.1732 1.4196 1.1517 1.1635 1.0538 1.0511 1.0566 1.0519 1.3312 1.0992 1.0686 1.0586 1.8788 7.0272 7.3616 6.2770 8.0841 6.3988 7.6964 1.0329 1.0321 1.0376 1.0317 1.0343 1.0374 1.1041 1.1043 1.0971 1.0968 1.1012 1.0973 1.0995 1.0988 1.0995 1.1006 1.1045 1.1055 1.0905 1.0898 1.0916 1.0920
irintensity: 1.1573 1.3001 0.7935 5.8682 2.1532 4.9593 6.7713 0.8872 3.0228 1.5916 9.3275 2.0412 0.5961 0.9219 0.1783 0.7898 2.8797 13.8699 9.2243 0.2062 1.3048 1.8512 0.8545 4.5831 3.1094 0.9064 6.5351 0.4809 6.1667 3.8160 2.9889 1.1034 8.5380 1.1140 0.7614 0.1045 10.9713 0.7257 2.9878 0.4862 4.8277 14.7153 37.2229 20.7914 3.3969 7.9889 3.5508 13.0069 7.2707 1.5986 17.6818 16.2634 1.8745 21.4202 21.8921 20.2064 5.4945 3.2544 30.4887 13.2405 90.7915 19.7088 16.0534 14.9507 140.6386 1.5386 1.3022 9.5845 47.5665 7.9748 9.1201 10.8341 0.2319 0.0945 145.5576 3.6630 53.1390 16.5361 157.8967 46.1413 11.3034 50.8895 46.5218 41.9283 755.0095 112.8722 46.0858 34.2016 20.7432 30.4455 200.9918 9.3629 8.3258 34.6220 57.6691 38.6080 44.8597 21.4286 8.9391 12.5511 13.1700 14.5273 14.9080 18.8128 18.9331 23.5452 59.1229 17.6597 17.1120 4.5482 259.2235 164.0484 27.8765 91.8828 0.8050 21.8014 66.9496 59.8979 4.4368 73.7027 59.0522 3.2639 41.7292 37.1686 13.6983 11.2284 29.2086 35.2975 23.7410 16.9703 19.4935 22.6833 13.9586 11.6563 6.4644 7.3187 1.8208 0.8292
temp: 298.150 k
press: 1.00000 atm
elementType: 8 8 8 8 8 8 6 6 6 6 6 6 6 6 6 6 6 6 6 6 6 6 6 6 6 6 1 1 1 1 1 1 1 1 1 1 1 1 1 1 1 1 1 1 1 1 1 1
symmnumber: 1
zpe: 985040.7 jmol-1
zpe.correction: 0.375182 hartree
zpe.thermalcorrener: 0.403221 hartree
zpe.thermalcorrenthalpy: 0.404165 hartree
zpe.thermalcorrgfe: 0.315079 hartree
zpe.sumelectzpe: -1224.693566 hartree
zpe.sumelectthermal: -1224.665527 hartree
zpe.sumelectthermalent: -1224.664583 hartree
zpe.sumelectthermalfe: -1224.753669 hartree
dipole: -4.5322 -1.3156 2.5200
dipole: 5.3500
quadrupole: -131.4273 -148.4959 -152.5423
quadrupole: 28.1827 3.7856 1.5775
quadrupole: 12.7279 -4.3408 -8.3871 28.1827 3.7856 1.5775
hfenergy: -1225.0687478 hartree
pointgroup: C01 [X(C20H22O6)]
dipole: 1.7348011 0.0185491 -1.191855 debye
polarizability: 344.0848047|8.1901382|249.3956048|5.0640458|57.5976788|200.0984063 unknown
InChI: InChI=1S/C20H22O6/c1-11(21)13-7-15(19(25-5)17(9-13)23-3)16-8-14(12(2)22)10-18(24-4)20(16)26-6/h7-10H,1-6H3
charge 0 multiplicity 1
48 atoms
O  -0.50523 2.463364 0.163673
O  0.504811 -1.435705 -2.092004
O  -3.286231 2.753471 0.486437
O  3.257672 -1.75548 -2.25459
O  -5.140643 -2.0319 0.1240
O  3.238747 1.761749 2.792602
C  -0.748661 0.073913 -0.005503
C  0.737267 -0.060917 -0.106303
C  -1.346456 1.349915 0.213657
C  1.340871 -0.808048 -1.159381
C  -1.578439 -1.070661 -0.091191
C  1.575063 0.526347 0.869629
C  -2.979609 -0.972812 0.060046
C  2.981021 0.398594 0.821241
C  -2.773127 1.453193 0.341387
C  2.765738 -0.961026 -1.203729
C  -3.570882 0.300411 0.280207
C  3.577452 -0.355918 -0.226215
C  -3.885593 -2.163167 -0.016188
C  3.79499 1.072684 1.88471
C  -3.277553 -3.539969 -0.266902
C  5.315104 0.922673 1.859566
C  -0.605103 3.50873 1.208158
C  0.701691 -1.108697 -3.523553
C  -4.745275 2.894093 0.550655
C  4.700921 -2.003036 -2.296799
H  -1.106285 -2.038028 -0.274709
H  1.145906 1.103501 1.692375
H  -4.660498 0.335873 0.374738
H  4.663453 -0.474161 -0.264666
H  -2.563964 -3.809768 0.533784
H  -2.721659 -3.562984 -1.222439
H  -4.084698 -4.287424 -0.29777
H  5.739644 1.32811 0.921884
H  5.612922 -0.140374 1.929398
H  5.741459 1.47196 2.712424
H  -1.566258 4.040008 1.140619
H  0.240009 4.18211 1.002067
H  -0.486909 3.059665 2.212353
H  0.568736 -0.022256 -3.682081
H  -0.089449 -1.663929 -4.04931
H  1.698504 -1.431261 -3.864537
H  -5.16093 2.373423 1.434253
H  -5.222623 2.503917 -0.368151
H  -4.924054 3.976009 0.635411
H  5.045867 -2.510719 -1.375399
H  5.268823 -1.063228 -2.44073
H  4.852458 -2.663745 -3.162824
