program: Gaussian 09
title: 000238708
version: EM64L-G09RevD.01
frameworkgroup: C1[X(C12H5Br3N2O4)]
method: RPBEPBE
basis: SDD
operation: Freq
keyword: #p
keyword: freq=noraman
keyword: PBEPBE/SDD
title: #p freq=noraman PBEPBE/SDD
converged: YES YES NO NO
title: Mulliken charges:
elementType: Br Br Br O O O O N N C C C C C C C C C C C C H H H H H
charge: 0.088201 0.088207 0.055879 -0.190057 -0.189937 -0.185133 -0.185133 0.020404 0.026074 0.471475 0.271211 -0.453317 -0.350294 -0.350287 -0.277486 0.411657 0.411760 -0.338177 -0.338179 -0.168890 -0.329952 0.301624 0.272017 0.313253 0.313254 0.311824
chargesum: 0.00000
title: Mulliken charges with hydrogens summed into heavy atoms:
elementType: Br Br Br O O O O N N C C C C C C C C C C C C
charge: 0.088201 0.088207 0.055879 -0.190057 -0.189937 -0.185133 -0.185133 0.020404 0.026074 0.471475 0.271211 -0.151693 -0.350294 -0.350287 -0.005469 0.411657 0.411760 -0.024924 -0.024925 -0.168890 -0.018128
polarizability: 2.94021165e+02 -4.06314625e-02 1.92940373e+02 8.39452605e-01 3.79772175e-02 1.72679723e+02
1716.lowfreq: -6.5194 -3.5501 -1.8128 -0.0007 -0.0006 0.0005 1.9688 24.1650 32.2201
frequency: -4.8277 24.1644 32.2157 50.2307 52.0082 68.5179 95.5392 128.4456 128.6989 135.1408 138.8448 178.4024 189.9224 195.0597 229.9099 252.5237 281.0426 287.3350 301.7066 378.0356 410.3095 412.4920 464.2057 482.3831 509.8202 516.8674 527.5360 559.6525 596.7354 678.2033 686.7556 690.7298 703.1591 709.0203 713.2942 743.7336 758.6046 824.0015 860.8298 904.1849 916.6653 926.6598 929.4885 942.6430 981.6943 1017.1632 1083.4211 1094.2589 1108.4206 1109.6999 1172.2566 1208.8435 1210.7459 1255.2511 1270.4474 1340.2753 1362.9558 1370.8021 1380.2955 1396.5303 1397.0483 1416.6435 1467.3064 1564.8417 1568.6905 1576.8545 1606.2727 3168.1863 3183.1141 3190.5040 3192.0595 3193.7941
redmass: 24.1600 21.0144 22.9308 16.1532 16.6064 21.2667 28.8422 18.0650 10.4049 19.4053 9.9905 4.6647 4.5900 19.6878 4.9326 22.5474 8.4279 12.4898 11.6998 9.3619 7.0213 9.0559 8.2005 5.8963 5.0738 6.7101 7.0162 4.4115 5.4970 12.3014 2.7244 11.4244 6.5135 5.9918 10.2567 7.1218 8.9419 12.4598 9.5780 1.5651 1.3570 1.5100 1.3644 1.4486 6.3584 5.1028 1.6846 1.7440 2.3436 3.4765 1.5616 13.7361 12.0265 1.2421 2.7574 5.0066 5.2432 7.8932 7.8491 11.0424 3.1132 3.6366 4.6500 10.1950 7.2077 8.1591 7.7403 1.0934 1.0932 1.0933 1.0927 1.0936
irintensity: 0.1600 0.5660 0.5493 0.0006 0.0154 0.1834 0.4310 2.6222 1.8429 0.7394 0.3419 0.6824 0.2542 0.4991 0.0000 0.6687 4.7058 1.6342 4.8094 0.5520 0.6935 8.3639 8.7339 4.9584 0.0057 0.7729 1.0573 1.6804 1.0124 4.8924 15.5612 49.1754 16.7047 16.3041 75.7640 24.0061 52.0647 0.4477 9.6664 14.7144 0.0043 33.6171 1.6450 15.2730 3.6222 8.7798 13.9740 20.8405 21.6808 55.7496 7.7280 436.6471 165.6716 6.1071 41.9097 18.8433 10.4506 17.3335 59.3522 238.5220 9.8924 106.4450 23.3662 50.5555 33.4977 3.4220 22.5232 0.2887 5.4819 10.8445 11.2014 14.5715
temp: 298.150 k
press: 1.00000 atm
elementType: 35 35 35 8 8 8 8 7 7 6 6 6 6 6 6 6 6 6 6 6 6 1 1 1 1 1
symmnumber: 1
zpe: 391801.5 jmol-1
zpe.correction: 0.149229 hartree
zpe.thermalcorrener: 0.167739 hartree
zpe.thermalcorrenthalpy: 0.168683 hartree
zpe.thermalcorrgfe: 0.098445 hartree
zpe.sumelectzpe: -909.413185 hartree
zpe.sumelectthermal: -909.394675 hartree
zpe.sumelectthermalent: -909.393731 hartree
zpe.sumelectthermalfe: -909.463969 hartree
dipole: 0.7659 -0.0008 -2.7884
dipole: 2.8916
quadrupole: -182.7108 -144.7120 -160.4594
quadrupole: -0.0072 -13.7154 -0.0067
quadrupole: -20.0833 17.9154 2.1680 -0.0072 -13.7154 -0.0067
hfenergy: -909.5624141 hartree
pointgroup: C01 [X(C12H5Br3N2O4)]
dipole: 0.0703043 -1.1354836 0.0014775 debye
dipolederiv: -0.1577529 0.0201276 0.2415398 0.0235985 0.0219294 -0.0310586 0.2326244 -0.0267713 -0.5160654 -0.157781 0.0194456 -0.2415627 0.0230155 0.0219288 0.0294459 -0.2326732 0.0251353 -0.5162535 -0.1617176 0.2376904 -0.0005565 0.2895842 -0.5902727 0.0012013 -0.0004867 0.0009586 0.0012823 -0.5195961 -0.0129961 0.0000205 0.0052683 -0.8494908 0.0010291 0.0000348 0.0008439 -0.1978432 -0.8844914 -0.0597631 0.0002048 -0.1271178 -0.5074433 0.0004074 -0.0000646 0.0004436 -0.2056701 -0.7775031 0.0679805 -0.1939569 0.0649277 -0.2141851 0.0213106 -0.1747862 0.0198674 -0.6319371 -0.7776914 0.0688385 0.1936474 0.0654477 -0.2143081 -0.0225266 0.1751583 -0.0219656 -0.6318009 1.3608961 0.3566567 -0.0007334 0.4200215 1.4505019 -0.0019307 -0.0006478 -0.0019418 0.1640625 1.9408415 -0.2100731 0.0004409 -0.2032253 0.2071687 0.0011668 -0.0003789 0.0022127 1.0134934 0.4037205 -0.0510698 0.0001184 -0.0227559 -0.0181519 -0.0008639 -0.0001129 -0.0004855 -0.5133692 0.3012241 -0.0090258 -0.0001021 -0.090687 -0.0281714 0.0002804 0.0001917 -0.00004 0.0587225 -0.1592558 0.2112917 -0.0003267 0.0544883 -0.0646737 -0.0002065 -0.0001509 0.0002781 -0.0693264 0.088148 -0.021405 -0.5631203 -0.0275044 -0.1126505 0.0690845 -0.4811456 0.0514459 0.9849999 0.0885461 -0.0203733 0.5630261 -0.0261749 -0.1128426 -0.0655656 0.4814207 -0.0485004 0.9857587 -0.2043715 0.2036442 -0.000073 0.1480414 -0.2084615 0.0007069 -0.0003134 0.0004463 -0.0311898 -0.0951646 -0.3564139 0.0006892 -0.3819181 -0.2738111 0.0005024 0.0008194 0.0004422 0.0786896 -0.6550418 0.0881703 -0.0000274 0.085282 0.0689105 0.0003758 -0.0001674 0.0003808 0.2747189 -0.0993058 0.0054816 0.255426 0.0046902 -0.0464417 -0.0323424 -0.0990566 0.011882 -0.3540314 -0.0995659 0.0051505 -0.2555011 0.0050023 -0.0464506 0.0312473 0.0990692 -0.0128344 -0.3542832 0.1028685 -0.5776132 0.0014162 -0.6421248 1.1769064 -0.0025628 0.0010546 -0.0021702 -0.1164629 -0.1322225 0.0278282 -0.0002881 0.3296845 -0.2876755 0.0004896 -0.0004674 0.0004204 -0.0550437 0.146032 0.0272505 -0.0000908 0.078722 0.0860325 0.0002253 -0.0001076 0.0000497 0.1386132 0.0813725 -0.0632935 -0.0002093 -0.0811746 0.0543795 -0.0002745 0.0001547 0.000113 0.1241038 0.1376529 0.0029982 -0.0381189 0.004074 0.1664679 0.0042804 0.0090799 -0.0013833 0.1015601 0.1376393 0.0031319 0.0381061 0.004061 0.1664432 -0.0044354 -0.009046 0.0011445 0.1014931 0.0925201 0.0363404 0.0000319 -0.0032263 0.1543616 0.0000133 -0.0000025 0.0000281 0.1657789 unknown
polarizability: 289.2693564|-23.5523116|177.4314324|0.0731083|-0.0340914|192.9404725 unknown
InChI: InChI=1S/C12H5Br3N2O4/c13-7-1-6(2-8(3-7)16(18)19)12-10(14)4-9(17(20)21)5-11(12)15/h1-5H
charge 0 multiplicity 1
26 atoms
Br -0.478091 -0.224739 -2.927541
Br -0.478153 -0.216041 2.928138
Br 3.568792 -3.60188 0.00607
O  3.388824 2.942681 -0.004502
O  5.221842 1.58557 -0.002124
O  -5.547102 0.366987 -1.141612
O  -5.547111 0.37036 1.140377
N  3.948261 1.781566 -0.003056
N  -4.953696 0.300099 -0.000514
C  -0.661433 -0.197587 0.000266
C  0.828358 -0.361478 0.000538
C  1.665182 0.776242 -0.001357
C  -1.403584 -0.114185 -1.212702
C  -1.403619 -0.110588 1.212964
C  1.3960 -1.66088 0.002723
C  3.060143 0.584247 -0.001025
C  -3.471829 0.12768 -0.00025
C  -2.800903 0.0480 -1.235151
C  -2.800937 0.051656 1.234901
C  2.799378 -1.807426 0.002999
C  3.657751 -0.693279 0.001137
H  1.259917 1.791289 -0.003034
H  0.748089 -2.542114 0.004199
H  -3.365995 0.113238 -2.167307
H  -3.36605 0.119648 2.166847
H  4.746265 -0.785767 0.001317
