program: Gaussian 09
title: 000238690
version: EM64L-G09RevD.01
frameworkgroup: C1[X(C12H8F4N2)]
method: RPBEPBE
basis: SDD
operation: Freq
keyword: #p
keyword: freq=noraman
keyword: PBEPBE/SDD
title: #p freq=noraman PBEPBE/SDD
converged: NO NO NO YES
title: Mulliken charges:
elementType: F F F F N N C C C C C C C C C C C C H H H H H H H H
charge: -0.189614 -0.189610 -0.189610 -0.189614 -0.703305 -0.703305 -0.058066 -0.058066 0.314988 0.314989 0.314988 0.314988 0.626442 0.626442 -0.621229 -0.621229 -0.621229 -0.621229 0.248186 0.248186 0.248186 0.248187 0.315131 0.315131 0.315131 0.315131
chargesum: 0.00000
title: Mulliken charges with hydrogens summed into heavy atoms:
elementType: F F F F N N C C C C C C C C C C C C
charge: -0.189614 -0.189610 -0.189610 -0.189614 -0.073043 -0.073043 -0.058066 -0.058066 0.314988 0.314989 0.314988 0.314988 0.626442 0.626442 -0.373042 -0.373043 -0.373043 -0.373043
polarizability: 2.37939956e+02 3.94004654e-05 1.04899394e+02 2.25417123e-04 -1.87160485e-06 1.04871442e+02
1716.lowfreq: -25.8397 -0.0006 -0.0005 0.0002 9.0106 9.0114 14.2011 46.8152 46.8195
frequency: -25.8397 46.6933 46.6977 125.8530 125.8751 185.4151 207.0504 207.0535 237.2522 237.9379 300.7219 300.7239 312.2696 353.4839 364.0767 364.1052 382.9574 382.9969 402.9846 402.9935 493.5280 493.5293 496.8721 551.1562 565.1988 575.1132 580.5965 585.9542 585.9790 637.7738 637.7757 678.1163 746.6533 746.6655 825.9920 826.5571 858.1194 858.1225 965.2357 965.2433 981.3290 985.1197 1006.6561 1055.0387 1055.0406 1142.6955 1156.2440 1203.1028 1203.1099 1263.6560 1353.9806 1380.2063 1380.2152 1386.4069 1456.6345 1456.6371 1498.7792 1551.9202 1575.1254 1575.1320 1644.7189 1645.8294 1656.9391 1668.5557 3162.0662 3162.0711 3165.6215 3165.7503 3569.0873 3569.5008 3709.6189 3709.6250
redmass: 10.3820 6.6399 6.6404 11.9339 11.9349 12.5612 6.0770 6.0767 4.5643 4.6799 4.1535 4.1533 14.5828 11.3521 5.8024 5.8016 1.0348 1.0337 1.2818 1.2817 5.8850 5.8848 8.8221 11.2333 8.8996 4.1048 4.1641 5.9481 5.9484 2.5019 2.5020 5.4043 3.2199 3.2204 1.4653 1.4625 2.5859 2.5860 6.6804 6.6810 4.3997 3.4636 5.1494 1.4424 1.4424 2.6884 1.7690 1.5358 1.5357 2.6127 5.0940 6.8979 6.8991 7.4795 4.5049 4.5048 4.8163 5.3067 8.2321 8.2322 1.2123 1.1868 6.1538 8.0614 1.0922 1.0922 1.0931 1.0930 1.0450 1.0452 1.1042 1.1042
irintensity: 0.0000 7.1822 7.1805 0.0289 0.0290 0.0000 2.7028 2.7047 0.0000 0.0000 0.7701 0.7717 10.9674 0.0000 7.0197 7.0305 0.0000 0.0001 298.8592 298.8552 1.4888 1.4903 22.5520 0.0000 0.6047 0.0000 0.0000 5.1770 5.1699 13.0899 13.0983 0.0000 5.4346 5.4271 0.0000 0.0000 81.5480 81.5948 92.1770 92.1631 11.7551 0.0000 18.5740 25.8814 25.8886 0.0000 169.3920 8.2910 8.2804 0.0000 22.8585 37.2493 37.2120 0.0000 24.6095 24.5943 138.1006 0.0000 109.8198 109.7593 84.4234 0.0001 1089.7448 0.0000 2.0651 2.0650 10.0105 0.0037 200.7146 0.0094 25.8192 25.8193
temp: 298.150 k
press: 1.00000 atm
elementType: 9 9 9 9 7 7 6 6 6 6 6 6 6 6 6 6 6 6 1 1 1 1 1 1 1 1
symmnumber: 1
zpe: 467487.1 jmol-1
zpe.correction: 0.178056 hartree
zpe.thermalcorrener: 0.193208 hartree
zpe.thermalcorrenthalpy: 0.194152 hartree
zpe.thermalcorrgfe: 0.136423 hartree
zpe.sumelectzpe: -969.690605 hartree
zpe.sumelectthermal: -969.675454 hartree
zpe.sumelectthermalent: -969.674510 hartree
zpe.sumelectthermalfe: -969.732239 hartree
dipole: 0.0000 0.0003 -0.0026
dipole: 0.0026
quadrupole: -35.6564 -106.4944 -106.4944
quadrupole: 0.0152 -0.0020 0.0000
quadrupole: 47.2254 -23.6127 -23.6127 0.0152 -0.0020 0.0000
hfenergy: -969.8686615 hartree
pointgroup: C01[X(C12H8F4N2)]
dipole: 0.000004 -0.0010264 0.0001171 debye
dipolederiv: -0.457315 0.2064571 0.2059984 0.2174842 -0.4770104 -0.3433917 0.2170285 -0.3433937 -0.4755592 -0.4572651 0.2059433 -0.2064717 0.2169402 -0.4753997 0.343406 -0.2175358 0.3434281 -0.4772151 -0.4572882 -0.2064336 -0.2060018 -0.2174594 -0.4770103 -0.3433994 -0.2170365 -0.3434138 -0.4755826 -0.4573384 -0.2059681 0.2065068 -0.216966 -0.4753552 0.3433785 0.2175657 0.3433836 -0.4771926 -1.7409634 0.0002414 -0.0002848 0.0007778 -0.4315695 0.3077381 -0.0008259 0.3077385 -0.4328329 -1.7409653 -0.0001103 -0.0002403 -0.0005226 -0.4330344 -0.3077376 -0.000652 -0.3077381 -0.4313666 -0.0235825 0.0000142 0.0000021 0.0000061 -0.3021424 -0.1652041 0.0000027 -0.1651831 -0.3014852 -0.023584 -0.0000258 0.0000172 -0.0000187 -0.301359 0.1652024 0.0000179 0.1651852 -0.3022698 0.8856202 -0.0560159 -0.0558192 -0.0581007 0.5988868 0.4534832 -0.0579123 0.4535016 0.5970094 0.8856076 -0.0558372 0.05598 -0.0579316 0.5967627 -0.4534856 0.0580714 -0.4535163 0.5991547 0.8856141 0.0559497 0.0558781 0.0580545 0.5989162 0.4534897 0.0579584 0.4535082 0.596996 0.8856282 0.0558615 -0.0559812 0.0579365 0.5967288 -0.4534773 -0.0580838 -0.4535015 0.599163 1.9066764 -0.0001597 0.0002051 -0.0001423 0.2117961 0.0289977 0.0001893 0.028998 0.2116767 1.9066785 0.0000203 0.0001559 0.0000028 0.2116605 -0.0289986 0.0001357 -0.0289962 0.2118122 -0.7311547 0.0332609 0.0331597 0.2303842 -0.2097734 0.0555746 0.2299407 0.0555847 -0.209923 -0.731126 0.0331995 -0.0332873 0.2299317 -0.2099909 -0.055578 -0.2304586 -0.0555563 -0.2097309 -0.7311404 -0.0332462 -0.0332095 -0.2304542 -0.2097085 0.0555789 -0.2299062 0.0555692 -0.2099992 -0.7311703 -0.0331486 0.0332382 -0.2298115 -0.2100191 -0.0555758 0.230483 -0.0555972 -0.209665 -0.0021664 -0.0527304 -0.0526403 -0.0454501 0.0932127 -0.1016244 -0.0453861 -0.1016506 0.0936059 -0.0021775 -0.0526186 0.0527533 -0.0453561 0.0936811 0.1016402 0.0454812 0.1016234 0.0931483 -0.0021723 0.0527507 0.0526213 0.0454723 0.0931924 -0.1016454 0.045365 -0.1016241 0.093631 -0.002161 0.0526115 -0.0527589 0.0453513 0.0936908 0.1016289 -0.0454844 0.1016512 0.093123 0.2339375 -0.0094091 -0.0093016 -0.0391703 0.2557641 -0.1304638 -0.0385145 -0.1305392 0.2560711 0.2339353 0.0093234 0.0093932 0.0385972 0.2555373 -0.1305365 0.0390957 -0.130463 0.256301 0.2339325 -0.0093088 0.0094133 -0.0385706 0.2561869 0.1305281 0.0391259 0.1304693 0.2556534 0.2339405 0.0093788 -0.0093261 0.0390154 0.2563565 0.130472 -0.038665 0.130532 0.2554764 unknown
polarizability: 237.9399556|-0.0042225|104.871442|0.0058833|0.0000272|104.8993946 unknown
InChI: InChI=1S/C12H8F4N2/c13-7-1-5(17)2-8(14)11(7)12-9(15)3-6(18)4-10(12)16/h1-4H,17-18H2
charge 0 multiplicity 1
26 atoms
F  -0.826991 -1.707299 -1.703892
F  0.827189 1.703521 -1.707829
F  -0.827088 1.707619 1.704013
F  0.826906 -1.703296 1.708175
N  -5.0289 0.000308 -0.000205
N  5.028907 -0.000018 0.000386
C  -0.74415 0.000146 0.000078
C  0.744158 0.000105 0.000157
C  -1.514544 -0.837902 -0.836321
C  1.514644 0.836171 -0.83814
C  -1.51459 0.838239 0.836391
C  1.514506 -0.836003 0.838537
C  -3.637241 0.000197 -0.000054
C  3.637249 -0.000018 0.000273
C  -2.913329 -0.86839 -0.866836
C  2.913432 0.866551 -0.868605
C  -2.913377 0.868776 0.866774
C  2.91329 -0.8665 0.86912
H  -3.423465 -1.553514 -1.550663
H  3.423644 1.550112 -1.553938
H  -3.423552 1.553996 1.550476
H  3.423388 -1.550029 1.554568
H  -5.549383 0.617196 0.616182
H  -5.54935 -0.617362 -0.615836
H  5.549324 -0.616162 0.617573
H  5.549424 0.615459 -0.617382
