program: Gaussian 09
title: 000238696
version: EM64L-G09RevD.01
frameworkgroup: C1[X(C12H9BrN2O2)]
method: RPBEPBE
basis: SDD
operation: Freq
keyword: #p
keyword: freq=noraman
keyword: PBEPBE/SDD
title: #p freq=noraman PBEPBE/SDD
converged: NO YES NO NO
title: Mulliken charges:
elementType: Br O O N N C C C C C C C C C C C C H H H H H H H H H
charge: 0.038773 -0.210125 -0.271471 -0.487184 0.025092 0.350577 0.188721 0.426498 -0.257333 -0.331540 -0.246816 -0.419611 -0.371799 -0.205600 -0.194724 -0.217023 -0.246332 0.354378 0.299775 0.291878 0.249767 0.270210 0.261332 0.233549 0.233299 0.235710
chargesum: 0.00000
title: Mulliken charges with hydrogens summed into heavy atoms:
elementType: Br O O N N C C C C C C C C C C C C
charge: 0.038773 -0.210125 -0.271471 -0.132806 0.025092 0.350577 0.188721 0.426498 0.042443 -0.039662 -0.246816 -0.169844 -0.101589 0.055732 0.038824 0.016276 -0.010622
polarizability: 2.60893771e+02 2.58811305e+01 2.42998805e+02 1.49758513e+01 -7.70197713e+00 7.94873467e+01
1716.lowfreq: -6.9975 -1.6050 -0.0005 -0.0005 -0.0004 3.5126 36.0220 45.4931 69.3427
frequency: 35.8987 45.4765 69.3392 73.0729 98.3001 155.5802 187.7678 199.7393 246.5726 262.3338 278.1834 345.5398 356.1501 408.1303 437.8900 469.2635 499.4156 522.8793 573.7544 577.2553 613.9090 641.6313 654.1036 668.5060 696.9431 707.2298 756.8024 782.3674 797.7032 810.1326 831.7244 844.7202 876.2759 900.1720 922.5832 974.6814 975.9743 987.0525 994.1450 1025.4760 1052.2179 1076.7673 1090.4563 1137.2014 1174.5100 1185.8851 1188.6440 1210.7559 1248.5497 1297.1694 1317.8574 1325.0731 1373.5548 1385.5064 1432.5788 1449.7050 1465.8045 1485.2674 1508.0053 1575.4166 1596.1241 1600.7129 1616.8426 3131.3255 3136.7770 3149.8141 3159.4250 3172.5777 3174.7276 3188.9887 3194.1297 3224.1830
redmass: 4.8130 6.7689 5.4327 8.4829 8.2572 7.8915 8.0417 5.1412 14.7280 6.5645 6.2191 7.0501 5.7891 2.9100 3.4379 8.0304 3.5589 6.8221 5.3751 6.8000 6.3225 5.1550 5.5804 8.1774 2.2112 4.3478 1.7614 6.7531 1.5645 1.4089 1.6113 1.7954 1.4142 5.5002 1.3967 1.3490 1.3561 5.3644 1.3119 2.1610 5.5097 1.9990 1.5901 2.0270 1.0538 3.5878 1.1288 2.3055 1.7440 1.8123 3.5709 1.5796 3.8149 7.4933 3.4060 2.5479 3.9931 2.3367 3.3923 3.5235 3.9054 6.7162 6.1211 1.0856 1.0882 1.0930 1.0959 1.1015 1.0882 1.0921 1.0975 1.0784
irintensity: 0.3063 0.3897 0.0430 2.5280 0.2272 1.3708 2.1647 2.8811 2.7011 0.9362 3.1281 0.4377 1.4183 0.6188 6.5938 8.8751 29.6809 4.4456 2.4847 0.2056 0.8634 16.7797 14.9576 3.0487 29.2924 10.2020 49.0321 10.1106 87.0071 26.5908 42.5074 27.3806 22.8171 59.5663 4.5129 0.5588 2.3220 0.4081 0.4306 8.5212 7.3182 43.4250 5.5660 110.9266 0.8412 340.4292 0.7445 21.5645 25.5959 47.2057 211.0831 38.2514 4.5713 6.4100 3.5502 23.9228 150.9749 146.8654 69.9697 230.0635 70.2061 300.6125 70.3019 5.9991 1.0846 14.8277 23.7838 17.9245 3.6946 0.3166 0.7022 100.3702
temp: 298.150 k
press: 1.00000 atm
elementType: 35 8 8 7 7 6 6 6 6 6 6 6 6 6 6 6 6 1 1 1 1 1 1 1 1 1
symmnumber: 1
zpe: 488263.2 jmol-1
zpe.correction: 0.185970 hartree
zpe.thermalcorrener: 0.200211 hartree
zpe.thermalcorrenthalpy: 0.201155 hartree
zpe.thermalcorrgfe: 0.142488 hartree
zpe.sumelectzpe: -734.827278 hartree
zpe.sumelectthermal: -734.813037 hartree
zpe.sumelectthermalent: -734.812093 hartree
zpe.sumelectthermalfe: -734.870761 hartree
dipole: -1.0076 -4.0411 -0.1142
dipole: 4.1664
quadrupole: -93.2468 -125.3457 -108.0079
quadrupole: 8.9095 3.3939 -4.3234
quadrupole: 15.6200 -16.4789 0.8589 8.9095 3.3939 -4.3234
hfenergy: -735.0132481 hartree
pointgroup: C01 [X(C12H9Br1N2O2)]
dipole: -1.0968821 -1.2176378 0.0337894 debye
dipolederiv: -0.05484 -0.0141483 -0.003666 0.1906325 -0.8041341 -0.0087883 0.0169238 -0.0015955 -0.0139423 -1.0570235 -0.5466349 -0.0448486 -0.4443085 -0.7732433 -0.0147391 -0.1330302 -0.0525156 -0.2360382 -0.4060641 0.4487229 -0.0695485 0.0131705 -0.7863413 0.0394927 -0.0267745 0.0667552 -0.2833167 -1.7767704 0.0737344 0.0082169 0.3452413 -0.3722855 0.0025346 -0.0790323 0.0029453 -0.3034657 1.0825042 0.1688314 0.1321983 0.8303024 2.0709188 -0.0423705 0.1753846 -0.0415329 0.2105573 1.4320109 -0.0362829 -0.0201991 -1.0421139 0.5250258 0.0338728 0.2090053 0.0627364 0.1413802 -0.3896552 0.1928063 -0.0079702 -0.6910665 -1.0936942 0.0110243 0.060333 0.0479701 -0.0291265 1.2650829 0.0503682 -0.0300547 0.4481824 0.042429 -0.0515945 -0.0146337 -0.0178181 0.1152797 -0.4522364 0.0849065 0.0154505 0.9011567 -0.5530877 0.0056485 -0.0400078 -0.0011191 -0.1168795 -0.0424726 -0.5324214 0.0013198 0.2031914 0.5384302 0.0010253 -0.0181919 -0.0795886 -0.0703029 0.7758825 0.2498774 0.0249184 -0.2987458 1.5598242 0.0188572 0.0233425 0.0188771 -0.1002851 -0.3178062 0.0211157 0.0114901 0.0239631 -0.0597986 -0.1070857 -0.0491838 -0.1041537 -0.0745602 -0.2324474 0.0177258 0.040003 -0.1527202 -0.1034883 -0.0427626 0.12745 -0.0478559 -0.0820667 -0.2677477 -0.1803817 0.0110762 -0.3284909 -0.8784107 -0.0219361 -0.0127667 -0.0255229 -0.1326516 0.094631 -0.0245497 0.0529342 -0.0454336 -0.0270179 -0.1066457 0.1609926 -0.1008497 -0.0168439 0.0195123 0.0039427 0.018086 0.0979845 0.0192527 -0.1432892 -0.0695643 -0.1411536 0.0000133 -0.0528027 0.0719828 -0.0106061 0.0291516 -0.120142 -0.0260139 -0.0031814 -0.0192097 -0.1579745 0.2026787 0.0242469 0.0004267 0.1029797 0.2702031 0.0235162 -0.1335008 0.0131117 0.2962837 0.0655461 -0.0704878 -0.0137559 -0.0590552 0.077457 0.0003267 -0.0141767 0.0014484 0.1428311 0.0892651 0.0121053 -0.0031699 -0.0780888 0.0793179 -0.0009159 -0.0115551 0.011898 0.1663826 0.0952444 -0.066544 0.0363983 -0.0541441 0.0445277 0.1087741 0.0238362 0.0956103 0.0636088 0.0177758 0.0362981 -0.0834114 0.0266115 0.0807799 0.0591632 -0.1262223 0.0587698 0.0765739 0.0020112 0.0479767 -0.0110708 0.0609117 0.0597503 0.005574 -0.0128962 0.0192834 0.1694014 -0.0392493 0.0527952 -0.080759 0.0635592 0.0788027 0.0833316 -0.1026687 0.0786636 0.0653131 0.0558768 -0.027143 0.0182756 -0.0652943 0.0194699 0.1266303 0.0492468 0.1167798 0.0384719 -0.1089063 -0.0588425 0.0082662 -0.0775766 0.1054545 0.0463699 0.0008716 0.038066 0.1313569 unknown
polarizability: 278.6531965|7.1697562|223.6974454|6.1887264|-21.2810906|81.0292814 unknown
InChI: InChI=1S/C12H9BrN2O2/c13-9-6-7-12(15(16)17)11(8-9)14-10-4-2-1-3-5-10/h1-8,14H
charge 0 multiplicity 1
26 atoms
Br 2.007988 -3.969695 -0.021128
O  3.179333 2.810446 0.049662
O  0.929244 2.927748 -0.290929
N  -0.509974 0.754502 -0.17026
N  2.033812 2.232936 -0.09462
C  0.68948 0.074217 -0.088382
C  1.952549 0.782318 -0.046335
C  -1.836773 0.251187 -0.042518
C  0.752077 -1.358621 -0.082056
C  3.183586 0.079297 0.043869
C  1.982012 -2.012992 -0.002475
C  -2.850944 0.872816 -0.819834
C  -2.191328 -0.771097 0.878862
C  3.218998 -1.317183 0.076505
C  -4.194523 0.465549 -0.690433
C  -3.53769 -1.178512 0.991816
C  -4.545193 -0.569078 0.208473
H  -0.378646 1.774636 -0.322475
H  -0.171205 -1.931125 -0.181739
H  4.103503 0.668115 0.084957
H  -2.577729 1.664124 -1.527109
H  -1.433975 -1.213041 1.533543
H  4.165587 -1.856972 0.14744
H  -4.966179 0.951942 -1.296842
H  -3.800944 -1.96381 1.708852
H  -5.588067 -0.888506 0.304054
