program: Gaussian 09
title: 000238707
version: EM64L-G09RevD.01
frameworkgroup: C1[X(C14H14Br2N2)]
method: RPBEPBE
basis: SDD
operation: Freq
keyword: #p
keyword: freq=noraman
keyword: PBEPBE/SDD
title: #p freq=noraman PBEPBE/SDD
converged: YES YES NO NO
title: Mulliken charges:
elementType: Br Br N N C C C C C C C C C C C C C C H H H H H H H H H H H H H H
charge: 0.007748 0.008765 -0.445941 -0.434747 0.510330 0.519068 0.506046 -0.535736 -0.662379 -0.608522 0.508432 -0.814052 -0.820389 -0.406152 -0.316798 -0.152783 -0.139515 -0.224396 0.256370 0.226425 0.235134 0.303391 0.300114 0.220214 0.228826 0.233121 0.226577 0.234324 0.223479 0.249732 0.288828 0.274487
chargesum: 0.00000
title: Mulliken charges with hydrogens summed into heavy atoms:
elementType: Br Br N N C C C C C C C C C C C C C C
charge: 0.007748 0.008765 -0.142550 -0.134633 0.510330 0.519068 0.506046 -0.279366 -0.435954 -0.373388 0.508432 -0.131892 -0.136009 -0.156420 -0.027970 -0.152783 -0.139515 0.050091
polarizability: 2.80478860e+02 -2.63252189e+01 1.93186698e+02 1.50435147e+01 -1.61653530e+00 1.46302881e+02
1716.lowfreq: -4.4320 -0.9020 -0.0002 0.0005 0.0006 3.9275 16.3291 17.3649 19.2969
frequency: 16.1162 17.2571 19.1510 27.4634 37.7562 108.1017 110.1566 119.3423 164.1625 172.0245 187.6955 198.1574 220.4003 231.2670 251.0035 264.5415 297.6493 330.4550 358.3940 367.4630 426.6454 495.9539 504.1069 511.5558 514.9785 527.8903 544.6346 559.9474 584.4984 641.9609 667.3053 676.5782 703.1420 711.9785 836.5786 849.3008 851.3217 862.5436 877.6455 880.9603 886.7885 935.2452 958.0140 967.0300 981.6572 1017.4004 1026.6968 1045.2775 1049.7512 1085.7573 1097.2799 1147.7936 1177.9696 1209.7560 1250.0093 1280.4774 1297.6412 1343.3479 1358.6845 1390.6064 1396.1691 1396.7297 1410.8053 1418.2189 1439.4987 1446.9062 1469.6348 1470.6749 1473.2807 1484.3607 1490.3793 1515.6183 1565.2548 1601.4650 1619.2108 1621.9098 2976.3210 2977.1551 3054.3250 3056.5987 3082.6525 3085.3366 3107.7050 3120.8597 3141.6681 3152.3895 3186.9247 3195.5424 3470.9646 3515.4739
redmass: 7.6110 1.7997 4.6536 1.4189 1.1544 11.2582 9.4363 9.2186 4.2253 5.0060 4.2855 3.5736 3.0805 3.7056 5.5642 3.2935 4.6573 2.8268 2.0808 3.7000 2.9968 1.7348 5.0529 3.9414 3.8874 2.6494 4.3937 4.0957 2.9819 5.8676 3.0876 2.9854 2.0030 8.4262 1.4207 1.5518 1.5092 1.3199 1.4332 7.1182 1.4485 2.5404 2.8982 5.5538 5.6392 1.5185 1.9513 1.5348 1.5922 1.8198 1.6052 1.8560 1.3954 2.6751 1.1874 1.6138 2.0349 3.4788 3.5715 5.7563 1.2761 1.2348 3.1808 2.1343 2.2325 3.0721 1.0474 1.0465 1.2625 1.5103 1.4473 1.9023 4.0790 7.1261 5.5791 5.8789 1.0372 1.0370 1.0975 1.0975 1.0991 1.0988 1.0910 1.0917 1.0911 1.0922 1.0920 1.0939 1.0768 1.0774
irintensity: 0.3130 0.1054 0.0931 1.0403 0.1009 0.0931 1.2557 1.4789 0.2081 2.5777 2.7100 1.9349 1.8694 1.6425 0.4752 0.4417 33.6684 27.6242 46.0246 43.4427 5.3362 73.8850 0.2183 15.5975 14.3279 21.7778 4.8966 6.3400 5.4921 15.6773 28.7173 12.6609 32.7647 60.9985 21.8422 29.9510 43.3019 4.9366 18.9284 60.8994 7.0532 17.9904 2.9853 17.5630 1.5408 2.2331 29.3359 0.9362 24.4832 10.7423 11.5335 6.7591 2.3964 21.1721 2.6918 8.4179 3.0549 32.9168 34.4823 41.4208 8.7943 12.2671 6.2248 25.8423 44.0495 59.0016 23.3145 7.8530 47.9742 67.8508 59.2527 35.8763 83.0896 452.5627 118.3661 94.6045 40.6183 31.4388 18.4693 21.3889 18.1381 21.5265 23.1819 16.6782 7.6204 3.5887 0.1517 1.2720 55.4987 36.0553
temp: 298.150 k
press: 1.00000 atm
elementType: 35 35 7 7 6 6 6 6 6 6 6 6 6 6 6 6 6 6 1 1 1 1 1 1 1 1 1 1 1 1 1 1
symmnumber: 1
zpe: 641074.6 jmol-1
zpe.correction: 0.244172 hartree
zpe.thermalcorrener: 0.262969 hartree
zpe.thermalcorrenthalpy: 0.263913 hartree
zpe.thermalcorrgfe: 0.191495 hartree
zpe.sumelectzpe: -677.002459 hartree
zpe.sumelectthermal: -676.983663 hartree
zpe.sumelectthermalent: -676.982719 hartree
zpe.sumelectthermalfe: -677.055137 hartree
dipole: -3.3842 -1.8232 -1.7207
dipole: 4.2116
quadrupole: -122.3014 -124.9613 -117.6612
quadrupole: -0.6893 3.6913 0.4505
quadrupole: -0.6601 -3.3200 3.9801 -0.6893 3.6913 0.4505
hfenergy: -677.2466316 hartree
pointgroup: C01 [X(C14H14Br2N2)]
dipole: -1.3117246 0.0995715 1.0074773 debye
polarizability: 270.4462701|42.8652993|192.216291|-7.4502098|17.5868368|157.3058776 unknown
InChI: InChI=1S/C14H14Br2N2/c1-9-3-10(2)5-13(4-9)17-18-14-7-11(15)6-12(16)8-14/h3-8,17-18H,1-2H3
charge 0 multiplicity 1
32 atoms
Br 3.067846 -2.343124 -2.350475
Br 5.237039 2.320921 0.348003
N  -0.577821 -0.660405 1.491239
N  0.499085 0.206119 1.615351
C  -1.74813 -0.312851 0.767777
C  -4.088148 -0.820883 0.210604
C  -2.95303 1.113299 -0.824967
C  -1.772872 0.801379 -0.103527
C  -2.908815 -1.119488 0.924607
C  -4.099823 0.302316 -0.660361
C  1.626883 0.127955 0.779267
C  -5.32918 -1.684175 0.365898
C  -2.969071 2.302636 -1.771074
C  2.669495 1.08487 0.941883
C  1.745666 -0.892997 -0.202931
C  2.905995 -0.931371 -0.993071
C  3.803067 0.995794 0.118544
C  3.9627 -0.003877 -0.865068
H  -0.873249 1.412855 -0.233008
H  -2.886232 -1.981116 1.605241
H  -5.015018 0.542681 -1.21557
H  -0.630849 -1.419212 2.174104
H  0.38634 1.031638 2.212025
H  -5.191194 -2.463887 1.134837
H  -6.207109 -1.07604 0.653058
H  -5.582538 -2.191005 -0.584582
H  -2.692085 3.237776 -1.24911
H  -2.244982 2.165593 -2.596467
H  -3.966663 2.44819 -2.219514
H  2.590105 1.872276 1.698082
H  0.937417 -1.615905 -0.329821
H  4.853875 -0.05656 -1.492073
