program: Gaussian 09
title: 000238689
version: EM64L-G09RevD.01
frameworkgroup: C1[X(C15H17N3O)]
method: RPBEPBE
basis: SDD
operation: Freq
keyword: #p
keyword: freq=noraman
keyword: PBEPBE/SDD
title: #p freq=noraman PBEPBE/SDD
converged: YES YES NO NO
title: Mulliken charges:
elementType: O N N N C C C C C C C C C C C C C C C H H H H H H H H H H H H H H H H H
charge: -0.297158 -0.216424 -0.194998 -0.476801 0.443468 -0.658536 0.265222 -0.624820 -0.390610 -0.358096 0.475993 -0.221217 -0.217028 -0.258938 -0.446891 -0.340224 -0.198157 -0.215811 -0.260887 0.231476 0.252423 0.236745 0.280739 0.224773 0.242254 0.239165 0.263801 0.342789 0.224349 0.227841 0.230731 0.219250 0.303322 0.222841 0.223347 0.226071
chargesum: 0.00000
title: Mulliken charges with hydrogens summed into heavy atoms:
elementType: O N N N C C C C C C C C C C C C C C C
charge: -0.297158 -0.216424 -0.194998 -0.134012 0.443468 0.062108 0.265222 0.122946 -0.151445 -0.094295 0.475993 0.003132 0.010813 -0.028207 -0.227642 -0.036902 0.024683 0.007536 -0.034817
polarizability: 2.52196659e+02 8.43255642e+00 1.72620395e+02 -9.72916182e+00 -9.16782252e+00 1.46467431e+02
1716.lowfreq: -13.0709 -3.4334 -0.0006 0.0002 0.0007 4.0065 22.8650 35.5324 45.3523
frequency: 22.7063 35.5161 45.2880 74.9548 81.1086 101.4457 125.5214 143.6708 150.8451 186.3985 195.0481 246.9084 261.8194 265.0912 313.9760 358.6025 369.7250 391.5441 408.0349 411.3181 474.3739 511.2178 515.4924 555.3153 600.3797 613.3000 617.5103 631.9836 680.3091 695.7594 696.6146 727.2179 752.3221 761.4496 767.6668 828.6158 831.6151 841.6791 862.5068 895.8388 912.5007 967.5229 969.1812 976.8630 981.0025 985.4425 987.8207 995.3023 1024.2917 1027.3744 1065.4305 1087.0791 1092.0399 1104.5647 1120.4295 1127.4860 1136.2699 1170.7588 1172.5857 1186.2164 1190.4783 1220.2242 1252.6534 1292.6449 1311.2125 1322.2380 1330.7811 1384.5054 1387.2056 1407.7726 1431.0823 1434.9740 1444.8827 1466.6429 1476.7490 1479.0337 1486.9061 1487.6198 1489.3943 1516.0160 1588.6744 1595.3864 1613.5120 1616.2353 1629.3922 2949.9665 2973.7635 3053.2020 3054.3437 3111.1587 3112.5182 3120.9155 3128.3947 3129.4478 3136.3332 3141.5915 3155.6976 3162.6530 3163.2025 3172.5944 3189.8630 3468.5094
redmass: 5.0821 3.9077 3.7372 6.8735 4.2253 3.8123 3.2397 2.8222 1.1572 2.4243 1.8200 3.3491 3.3072 2.7693 4.9457 5.2536 4.9359 4.3172 2.9350 2.9187 4.2531 3.0701 3.4951 4.5134 5.7209 6.3672 6.3812 5.2746 2.6717 1.9326 2.0556 1.6344 4.4212 1.7602 1.6671 3.2170 1.4594 1.2666 4.8314 1.4393 1.4437 1.3618 1.3492 3.2023 5.1539 4.4881 1.3423 1.3046 2.3793 2.0798 2.9003 1.5488 1.7482 1.3526 2.0976 1.4808 1.7998 1.0511 1.0513 1.1144 1.1229 3.6034 2.0076 3.7758 2.5094 1.3615 1.7099 7.5310 6.6878 1.1891 1.2468 2.2083 2.2699 1.0961 1.0752 1.4931 1.7258 1.7402 1.0661 2.4287 6.3705 5.7757 6.4926 5.7128 6.8495 1.0444 1.0359 1.0967 1.0952 1.0879 1.0996 1.0975 1.0848 1.0868 1.0889 1.0935 1.0922 1.0946 1.0997 1.1003 1.0951 1.0749
irintensity: 0.0604 0.0703 0.7188 2.6643 0.5544 0.8523 4.1744 2.1129 1.0463 2.7713 2.4837 0.5483 9.5759 14.3419 3.0528 2.7033 9.7629 4.7350 0.0190 0.1073 44.8801 4.5433 34.2564 18.5680 1.9271 0.1094 2.4818 0.3328 1.7708 29.7628 26.9176 39.9661 24.7158 80.4461 113.3450 6.3041 0.6603 0.5994 10.4386 6.6874 13.0424 0.2499 0.0646 39.5714 5.7539 3.9392 1.6561 2.6236 7.8142 7.0080 0.9616 43.4415 10.2227 36.2402 22.0519 3.8726 131.1543 0.7529 0.3752 3.6374 4.0208 30.4261 6.6131 54.6840 4.1576 0.2046 61.0524 22.5765 30.3665 33.9362 31.5878 149.2606 5.6434 17.7366 63.4061 92.5514 95.0102 13.2949 15.1076 791.0670 6.4743 33.9188 159.4781 83.5388 179.6779 53.0584 77.8177 34.1313 19.4857 16.4748 14.5957 0.3129 3.4238 0.9749 9.1073 34.9587 26.4427 25.7570 26.6611 7.6977 8.0153 84.3321
temp: 298.150 k
press: 1.00000 atm
elementType: 8 7 7 7 6 6 6 6 6 6 6 6 6 6 6 6 6 6 6 1 1 1 1 1 1 1 1 1 1 1 1 1 1 1 1 1
symmnumber: 1
zpe: 766933.2 jmol-1
zpe.correction: 0.292109 hartree
zpe.thermalcorrener: 0.309726 hartree
zpe.thermalcorrenthalpy: 0.310670 hartree
zpe.thermalcorrgfe: 0.245137 hartree
zpe.sumelectzpe: -819.891601 hartree
zpe.sumelectthermal: -819.873985 hartree
zpe.sumelectthermalent: -819.873041 hartree
zpe.sumelectthermalfe: -819.938574 hartree
dipole: -3.2716 -1.1001 2.6716
dipole: 4.3647
quadrupole: -107.3193 -112.0872 -106.5427
quadrupole: -4.9763 -2.2998 1.9773
quadrupole: 1.3304 -3.4374 2.1070 -4.9763 -2.2998 1.9773
hfenergy: -820.1837108 hartree
pointgroup: C01 [X(C15H17N3O1)]
dipole: -1.2875918 -0.3926114 1.066204 debye
polarizability: 251.9751548|9.6318692|171.7202134|-9.1670932|-10.9045043|147.5891175 unknown
InChI: InChI=1S/C15H17N3O/c1-17(14-11-7-4-8-12-14)18(2)15(19)16-13-9-5-3-6-10-13/h3-12,16H,1-2H3
charge 0 multiplicity 1
36 atoms
O  1.195993 2.312596 -1.054157
N  -1.444809 0.718643 0.830943
N  -0.801113 1.625617 -0.049186
N  1.129819 0.323908 0.235315
C  -2.41019 -0.165642 0.244031
C  -1.654738 1.229876 2.205258
C  0.579383 1.467997 -0.337204
C  -1.550495 2.779578 -0.573442
C  -3.443714 -0.746684 1.029142
C  -2.311607 -0.509659 -1.134033
C  2.471406 -0.132797 0.159309
C  -4.347761 -1.661039 0.444068
C  -3.225621 -1.417662 -1.703937
C  -4.249336 -2.004355 -0.922197
C  2.778079 -1.357825 0.814273
C  3.498263 0.571125 -0.526343
C  4.089949 -1.871714 0.786582
C  4.806841 0.041919 -0.543362
C  5.116542 -1.174595 0.107186
H  -2.591681 1.815963 2.310771
H  -0.79858 1.872043 2.46452
H  -1.685192 0.389801 2.920661
H  -0.878888 3.326997 -1.252003
H  -1.866124 3.458599 0.241622
H  -2.443286 2.438661 -1.128466
H  -3.553615 -0.491843 2.086996
H  -1.519952 -0.066068 -1.745812
H  0.458682 -0.248978 0.759375
H  -5.137479 -2.100582 1.064052
H  -3.133675 -1.670821 -2.766144
H  -4.955487 -2.710757 -1.370486
H  1.986143 -1.906654 1.340524
H  3.256899 1.508052 -1.031888
H  4.30895 -2.817445 1.295042
H  5.592502 0.591204 -1.074881
H  6.136292 -1.57336 0.085169
