program: Gaussian 09
title: 000238672
version: EM64L-G09RevD.01
frameworkgroup: C1[X(C11H12N2O2S)]
method: RPBEPBE
basis: SDD
operation: Freq
keyword: #p
keyword: freq=noraman
keyword: PBEPBE/SDD
title: #p freq=noraman PBEPBE/SDD
converged: NO YES NO NO
title: Mulliken charges:
elementType: S O O N N C C C C C C C C C C C H H H H H H H H H H H H
charge: 0.168802 -0.213784 -0.238800 -0.389887 -0.399491 -0.111947 -0.686502 0.162432 0.201857 -0.870634 0.526141 -0.383033 -0.416316 -0.228740 -0.212095 -0.213707 0.280740 0.264927 0.303880 0.367197 0.350528 0.272538 0.275641 0.251514 0.235986 0.233887 0.231894 0.236969
chargesum: 0.00000
title: Mulliken charges with hydrogens summed into heavy atoms:
elementType: S O O N N C C C C C C C C C C C
charge: 0.168802 -0.213784 -0.238800 -0.022690 -0.048963 0.168793 -0.117695 0.162432 0.201857 -0.322454 0.526141 -0.131518 -0.180331 0.005147 0.019799 0.023262
polarizability: 1.46634554e+02 -1.63186954e+01 1.72779398e+02 -1.32437100e+01 -5.18480766e+00 1.16096421e+02
1716.lowfreq: -6.3264 0.0019 0.0021 0.0021 3.8021 5.1853 21.9358 36.6818 43.7135
frequency: 21.5748 36.6526 43.6890 61.6740 95.7623 114.1567 132.0402 164.6335 204.9328 238.2002 298.5070 329.1625 378.1636 401.3062 409.5771 464.0315 534.6664 552.1379 558.9566 594.9901 606.0389 614.5022 635.3319 655.7062 669.7654 702.4223 711.8081 738.1508 769.1375 801.1211 820.8449 853.4313 872.8829 912.1439 929.9415 953.8623 976.7246 988.8179 999.4555 1025.7754 1026.4531 1078.1512 1096.8752 1143.9888 1175.6857 1179.0493 1181.9286 1187.5140 1217.2393 1219.1417 1230.3609 1269.9720 1304.4574 1315.6548 1325.4625 1338.5616 1366.4400 1382.2143 1427.3982 1437.2462 1450.1383 1482.8268 1590.7130 1608.7141 1680.9860 1722.4072 2994.0760 3025.8605 3033.7887 3096.9150 3112.3307 3118.8079 3123.6887 3143.2152 3151.7398 3173.0215 3552.2763 3590.0309
redmass: 7.4893 5.8097 4.8515 5.1547 4.8539 4.6145 7.3832 9.6141 4.1108 7.4576 4.2154 2.1631 10.4444 2.8269 3.4588 3.8521 1.7318 4.1062 2.5962 2.7722 6.3527 6.0168 4.5809 1.6484 3.0456 1.7950 7.4080 5.3213 1.8775 4.2987 2.4468 1.2574 1.9112 2.0546 1.6696 3.2890 1.3898 6.0380 1.3303 2.4496 2.2955 1.5735 2.4222 1.0943 1.0586 1.1460 2.8655 1.1116 1.5459 1.9620 1.5000 1.6321 1.6201 1.8812 1.2817 2.0648 1.7690 8.2542 1.0926 1.8657 1.2117 2.3150 6.0097 6.0733 8.5665 9.6610 1.0835 1.0584 1.0576 1.1065 1.1071 1.0888 1.0876 1.0904 1.0955 1.1010 1.0811 1.0805
irintensity: 0.0892 0.5385 0.5001 0.2248 1.7476 0.2283 2.9709 3.5913 4.2140 2.2190 0.8689 1.2453 23.3108 0.2037 3.5700 2.1652 32.2185 16.0955 11.5841 52.0088 34.9940 1.4695 16.0919 87.3942 55.9987 61.4101 64.8904 14.3939 40.2407 5.6004 9.7541 1.4288 4.8906 10.8190 2.1756 18.2738 0.0349 0.3639 0.1576 6.0629 0.8389 13.0113 40.1404 2.3323 0.7773 16.7326 62.5998 1.0874 18.8061 18.3809 7.9620 72.7042 28.6939 37.2170 0.8571 115.8949 5.2385 0.1109 13.7039 9.1739 16.8920 13.5159 1.4592 1.5803 540.6126 259.1195 10.0722 20.2575 5.9827 4.1069 2.4846 9.2544 4.7382 1.7818 28.0221 14.2203 134.6640 62.9885
temp: 298.150 k
press: 1.00000 atm
elementType: 16 8 8 7 7 6 6 6 6 6 6 6 6 6 6 6 1 1 1 1 1 1 1 1 1 1 1 1
symmnumber: 1
zpe: 564804.9 jmol-1
zpe.correction: 0.215123 hartree
zpe.thermalcorrener: 0.229918 hartree
zpe.thermalcorrenthalpy: 0.230862 hartree
zpe.thermalcorrgfe: 0.170835 hartree
zpe.sumelectzpe: -1083.256016 hartree
zpe.sumelectthermal: -1083.241221 hartree
zpe.sumelectthermalent: -1083.240276 hartree
zpe.sumelectthermalfe: -1083.300304 hartree
dipole: 2.7941 0.6641 0.5900
dipole: 2.9319
quadrupole: -108.8405 -109.0369 -94.5038
quadrupole: 4.8786 0.1434 -1.5380
quadrupole: -4.7134 -4.9098 9.6233 4.8786 0.1434 -1.5380
hfenergy: -1083.4711386 hartree
pointgroup: C01 [X(C11H12N2O2S1)]
dipole: -1.02665 -0.2208886 0.4772516 debye
polarizability: 152.8340801|-13.9819141|168.8489735|12.9027198|-10.5144872|113.82732 unknown
InChI: InChI=1S/C11H12N2O2S/c14-10-9(12-11(15)13-10)7-16-6-8-4-2-1-3-5-8/h1-5,9,12-13H,6-7H2
charge 0 multiplicity 1
28 atoms
S  -0.135027 -2.848614 0.368867
O  3.934574 -0.263375 -0.058158
O  0.442125 2.571209 -1.494839
N  0.542631 0.221551 -1.084772
N  2.4182 1.41741 -0.788123
C  1.541028 -0.759514 -0.641255
C  1.187334 -1.51881 0.655905
C  2.807308 0.122401 -0.448905
C  1.03283 1.514896 -1.170685
C  -1.619034 -2.144684 1.362332
C  -2.144794 -0.834618 0.829573
C  -2.805836 -0.772997 -0.428027
C  -1.960204 0.366172 1.56188
C  -3.256004 0.462297 -0.943495
C  -2.407323 1.604745 1.044743
C  -3.049731 1.657629 -0.21184
H  1.760217 -1.499283 -1.436725
H  0.818696 -0.822675 1.427557
H  2.087819 -2.033524 1.028713
H  -0.443982 0.003322 -1.232127
H  3.029545 2.233813 -0.767074
H  -1.303894 -2.06995 2.415795
H  -2.356011 -2.961463 1.272389
H  -2.958091 -1.69542 -1.001429
H  -1.465423 0.332186 2.540772
H  -3.76189 0.496783 -1.914717
H  -2.243462 2.525556 1.614608
H  -3.377501 2.617755 -0.622761
