program: Gaussian 09
title: 000238680
version: EM64L-G09RevD.01
frameworkgroup: C1[X(C18H20N2O2)]
method: RPBEPBE
basis: SDD
operation: Freq
keyword: #p
keyword: freq=noraman
keyword: PBEPBE/SDD
title: #p freq=noraman PBEPBE/SDD
converged: YES YES NO NO
title: Mulliken charges:
elementType: O O N N C C C C C C C C C C C C C C C C C C H H H H H H H H H H H H H H H H H H H H
charge: -0.257530 -0.327039 -0.355232 -0.450609 -0.230660 -0.640466 0.502968 0.185639 -0.453865 -0.382636 0.463609 0.287787 -0.227606 -0.235080 -0.452924 -0.353631 0.450315 -0.242526 -0.367410 -0.384650 -0.785640 -0.811706 0.286125 0.247924 0.255880 0.326138 0.365419 0.238304 0.232372 0.228552 0.228673 0.241964 0.301120 0.231611 0.228471 0.227320 0.265668 0.242995 0.240432 0.224444 0.222153 0.233328
chargesum: 0.00000
title: Mulliken charges with hydrogens summed into heavy atoms:
elementType: O O N N C C C C C C C C C C C C C C C C C C
charge: -0.257530 -0.327039 -0.029095 -0.085191 0.055464 -0.136662 0.502968 0.185639 -0.215561 -0.150264 0.463609 0.287787 0.000946 -0.006407 -0.210959 -0.052511 0.450315 -0.010915 -0.138939 -0.157330 -0.036546 -0.131781
polarizability: 3.25034337e+02 6.78539697e+00 1.75086682e+02 -9.78368573e+00 2.22251065e+01 1.56162703e+02
1716.lowfreq: -89.4654 -4.7674 -0.0009 -0.0003 0.0006 1.0787 5.6858 17.5259 30.1371
frequency: -89.4635 17.4164 30.0235 38.3936 44.4584 45.9795 47.2631 78.4345 83.7276 97.1398 127.4317 166.0970 181.7599 194.6167 206.4557 238.1586 297.8733 308.0137 333.0845 355.7829 377.6606 404.1307 409.2073 415.9434 431.2631 482.1934 520.6506 536.1557 539.0288 560.7041 589.8542 605.2086 617.2419 633.8375 673.3576 707.0979 720.3234 738.2038 750.5546 779.3275 823.2744 829.0473 833.6304 853.4633 854.9742 858.6321 906.9376 922.4419 933.3514 946.9341 956.2979 977.5614 985.8816 987.3142 989.3595 990.3748 997.8212 1009.6327 1026.1483 1038.0729 1041.3231 1046.4309 1090.2504 1110.1914 1127.0046 1161.2960 1173.1005 1188.6856 1192.3771 1207.4440 1218.5008 1223.0327 1271.5334 1279.4076 1282.5377 1312.8806 1319.0816 1333.8080 1343.0418 1371.1078 1381.6536 1381.6835 1397.0734 1414.1300 1440.0416 1442.6811 1459.2867 1466.8449 1472.2898 1473.6752 1484.0597 1490.0833 1510.3527 1547.8739 1583.3135 1592.1685 1601.7336 1614.2926 1628.1417 1642.5320 2971.3937 2993.2683 2993.9063 3014.0228 3051.6803 3069.8891 3079.5981 3081.2061 3110.9520 3115.2630 3115.8794 3123.1450 3132.3990 3137.3255 3138.9924 3144.7191 3163.4668 3189.9429 3204.9567 3531.1027
redmass: 1.0320 4.9361 4.0163 4.2237 4.0528 1.0149 4.2691 6.7756 4.8974 4.9774 4.9167 4.3028 4.4076 5.5537 4.7420 4.9410 4.1009 6.1642 2.2547 4.1517 3.5738 2.8237 3.0699 3.5543 3.4062 4.4089 2.7448 2.2159 2.2235 3.4031 2.6480 4.0766 6.3557 6.8131 5.4373 1.9150 3.0271 5.0847 1.7651 4.7126 1.7840 2.5350 4.5281 1.3011 1.4420 1.8016 1.7820 1.4038 2.1258 3.5643 1.3512 1.3959 1.3530 1.5632 2.2811 2.3937 1.3494 2.9453 2.2564 1.7472 1.9046 1.5453 1.7365 3.6110 1.2962 1.7492 1.0604 1.1335 1.1200 2.0780 2.4248 2.6541 1.4027 1.9014 2.2580 1.4126 1.4563 1.2942 1.4458 5.2021 4.0555 1.4510 1.2250 3.5128 2.1427 1.2413 1.1140 1.0471 1.1011 1.0528 2.3022 1.8003 2.7277 2.5863 4.8566 6.0710 6.1013 6.1341 6.2866 2.3956 1.0388 1.0807 1.0407 1.0613 1.0947 1.1010 1.0982 1.0996 1.0881 1.0873 1.0874 1.0907 1.0899 1.0984 1.0971 1.0955 1.1014 1.0943 1.0841 1.0782
irintensity: 0.0043 0.0866 0.1708 0.5380 2.8223 0.5377 1.3863 3.3920 2.3014 13.3148 4.2331 9.0153 3.1179 12.3670 8.3274 1.1177 3.4928 6.9762 1.4452 0.5024 0.2171 0.1055 0.7586 2.8821 10.0287 20.5295 15.7475 79.9579 56.5345 43.7871 6.5916 10.5457 0.1623 0.4152 0.8928 43.6659 1.2520 10.0008 54.0478 4.1547 12.9803 10.3709 6.8837 29.3246 0.8507 5.1750 49.0650 26.3443 27.7291 3.2918 26.5651 0.1355 3.1888 0.7299 1.3754 0.0527 0.2753 1.4475 3.5772 16.9271 3.5208 19.0384 14.8569 5.8012 18.6271 3.5876 0.2482 1.2531 0.4791 17.9221 0.1484 0.6482 4.8180 28.8798 31.6179 23.0414 2.2714 5.2425 2.9619 37.5517 9.9520 35.3930 5.8624 11.9874 7.4367 123.6781 23.0961 15.8276 23.8796 12.3996 32.2938 123.2989 102.7351 455.4588 141.7305 8.3170 183.6517 10.0494 3.8392 133.1855 52.4706 4.4047 9.2015 7.0585 25.6528 7.9412 11.1341 18.8306 9.4295 17.8958 9.6011 29.2362 7.0252 5.2836 12.7339 36.6198 24.4227 4.2498 382.8193 29.2558
temp: 298.150 k
press: 1.00000 atm
elementType: 8 8 7 7 6 6 6 6 6 6 6 6 6 6 6 6 6 6 6 6 6 6 1 1 1 1 1 1 1 1 1 1 1 1 1 1 1 1 1 1 1 1
symmnumber: 1
zpe: 895914.8 jmol-1
zpe.correction: 0.341236 hartree
zpe.thermalcorrener: 0.361790 hartree
zpe.thermalcorrenthalpy: 0.362734 hartree
zpe.thermalcorrgfe: 0.288691 hartree
zpe.sumelectzpe: -956.324882 hartree
zpe.sumelectthermal: -956.304328 hartree
zpe.sumelectthermalent: -956.303384 hartree
zpe.sumelectthermalfe: -956.377427 hartree
dipole: 3.1333 2.2221 -1.0952
dipole: 3.9944
quadrupole: -107.7384 -134.4729 -124.8739
quadrupole: 3.3238 -3.7717 -4.7189
quadrupole: 14.6233 -12.1111 -2.5122 3.3238 -3.7717 -4.7189
hfenergy: -956.6661178 hartree
pointgroup: C01 [X(C18H20N2O2)]
dipole: 1.2784566 0.8358003 0.369624 debye
polarizability: 325.5127369|4.7972179|141.2648017|-4.8727739|4.4998367|189.5061833 unknown
InChI: InChI=1S/C18H20N2O2/c1-13-8-10-16(11-9-13)20-18(22)17(19-14(2)21)12-15-6-4-3-5-7-15/h3-11,17,19-20H,12H2,1-2H3
charge 0 multiplicity 1
42 atoms
O  -0.76286 -0.716098 -2.036885
O  0.196983 0.913148 2.122064
N  1.357414 0.947481 0.117656
N  -1.445796 -0.250052 0.174699
C  0.957603 -0.426083 -0.2723
C  1.933261 -0.992952 -1.330401
C  3.391829 -0.933488 -0.89877
C  -0.509531 -0.47514 -0.816165
C  4.316008 -0.102587 -1.582802
C  3.860315 -1.703809 0.1982
C  -2.863474 -0.20541 0.056831
C  1.010059 1.504105 1.328351
C  5.671048 -0.035592 -1.180698
C  5.21105 -1.640795 0.603329
C  -3.602254 0.120395 1.226328
C  -3.560075 -0.477359 -1.150661
C  -5.723468 -0.092565 -0.009975
C  6.122364 -0.803423 -0.083732
C  -5.008948 0.172626 1.187457
C  -4.969856 -0.419249 -1.165948
C  1.640094 2.850157 1.656323
C  -7.239325 -0.004258 -0.055555
H  0.993217 -1.0362 0.652386
H  1.623665 -2.034825 -1.529966
H  1.776062 -0.449877 -2.279675
H  2.025289 1.433305 -0.485653
H  -1.041902 0.003676 1.100658
H  3.977292 0.47971 -2.449857
H  3.164891 -2.362565 0.733755
H  6.371164 0.607452 -1.726025
H  5.555515 -2.245911 1.449554
H  -3.069954 0.329485 2.162472
H  -2.994529 -0.729139 -2.049716
H  7.171493 -0.756766 0.228658
H  -5.560798 0.422958 2.10176
H  -5.495921 -0.635235 -2.104245
H  1.288882 3.173718 2.646466
H  2.743029 2.783155 1.670437
H  1.352775 3.614136 0.91078
H  -7.662758 -0.694332 -0.806863
H  -7.689539 -0.24884 0.923044
H  -7.573713 1.017242 -0.32422
