program: Gaussian 09
title: 000238666
version: EM64L-G09RevD.01
frameworkgroup: C1[X(C6H11IO5)]
method: RPBEPBE
basis: SDD
operation: Freq
keyword: #p
keyword: freq=noraman
keyword: PBEPBE/SDD
title: #p freq=noraman PBEPBE/SDD
converged: YES YES NO NO
title: Mulliken charges:
elementType: I O O O O O C C C C C C H H H H H H H H H H H
charge: 0.022345 -0.269178 -0.483120 -0.434121 -0.441474 -0.440750 -0.181637 -0.122958 -0.065997 -0.152818 -0.128583 -0.777427 0.302100 0.238881 0.283687 0.286776 0.269859 0.313278 0.323027 0.372341 0.335069 0.363919 0.386782
chargesum: 0.00000
title: Mulliken charges with hydrogens summed into heavy atoms:
elementType: I O O O O O C C C C C C
charge: 0.022345 -0.269178 -0.110779 -0.099052 -0.077555 -0.053968 0.120463 0.115923 0.217690 0.133959 0.141276 -0.141123
polarizability: 1.41651699e+02 1.22761102e+01 9.33907505e+01 -8.49908757e-01 -9.56786533e-01 7.70687599e+01
1716.lowfreq: -9.3583 -5.5225 0.0004 0.0006 0.0007 11.0681 36.5481 71.8605 93.1368
frequency: 36.3781 71.7711 93.1328 131.5108 139.5555 204.9305 224.9331 268.1035 281.5485 327.7972 382.2567 390.3812 406.6504 435.8553 461.7159 465.2369 485.6829 494.1742 546.9556 558.6963 586.0291 640.7299 748.8246 808.7238 854.7332 870.4883 914.4267 944.2691 967.2368 992.4726 1006.0452 1017.5130 1050.5858 1082.1031 1105.8265 1130.5717 1167.8793 1200.8578 1217.8644 1231.8639 1243.6534 1278.3040 1285.4822 1311.1850 1319.3441 1329.4010 1336.7741 1365.1206 1374.0130 1385.0613 1415.7723 1440.9650 2968.2894 3036.0203 3061.6071 3072.9705 3076.4767 3094.2881 3168.7112 3305.9994 3462.1914 3485.5913 3578.4293
redmass: 7.8958 5.8780 5.7612 9.9613 4.4715 6.7588 8.1015 4.2839 5.5401 5.0196 3.8977 1.3193 4.4047 2.3160 1.4937 1.2477 2.9655 3.8971 4.3390 4.8114 2.5397 1.6216 4.7660 1.7083 3.6675 3.1679 3.8422 5.3159 2.8168 3.8480 2.8782 5.0058 3.4450 2.4508 2.4537 1.4483 1.1212 1.1628 1.2023 1.4122 1.2662 1.2368 1.2799 1.1758 1.3020 1.1476 1.4256 1.3573 1.2882 1.4941 1.2208 1.0974 1.0837 1.0865 1.0868 1.0560 1.0864 1.0899 1.1112 1.0684 1.0659 1.0648 1.0666
irintensity: 0.1641 3.2591 3.5797 4.6520 5.1408 2.0375 6.3725 4.3361 16.6238 21.6205 13.4834 92.3866 62.0689 17.6509 68.8988 67.1428 82.5904 8.8237 4.6740 17.8888 143.9817 23.4514 74.9030 9.4802 21.5942 6.1525 128.1054 86.8114 52.8719 76.8788 32.6961 179.5683 41.0600 25.4801 14.8117 3.8362 28.6477 28.4897 13.8571 76.5193 38.2914 3.5803 4.2721 24.7057 20.2858 2.9930 9.0003 0.3052 60.5733 4.2907 91.8548 10.9717 21.6576 10.1913 6.1273 1.8910 12.3955 31.0208 0.5184 152.7532 72.4416 20.8751 15.8016
temp: 298.150 k
press: 1.00000 atm
elementType: 53 8 8 8 8 8 6 6 6 6 6 6 1 1 1 1 1 1 1 1 1 1 1
symmnumber: 1
zpe: 462607.7 jmol-1
zpe.correction: 0.176198 hartree
zpe.thermalcorrener: 0.188841 hartree
zpe.thermalcorrenthalpy: 0.189786 hartree
zpe.thermalcorrgfe: 0.135871 hartree
zpe.sumelectzpe: -621.849499 hartree
zpe.sumelectthermal: -621.836855 hartree
zpe.sumelectthermalent: -621.835911 hartree
zpe.sumelectthermalfe: -621.889826 hartree
dipole: 0.9844 1.1960 0.8906
dipole: 1.7868
quadrupole: -94.8924 -84.6554 -90.3994
quadrupole: -0.3783 -4.5380 7.2048
quadrupole: -4.9100 5.3270 -0.4170 -0.3783 -4.5380 7.2048
hfenergy: -622.0256966 hartree
pointgroup: C01 [X(C6H11I1O5)]
dipole: -0.1621504 -0.5988234 0.3306331 debye
dipolederiv: -0.4236456 -0.1135289 0.0421372 -0.236284 -0.3395748 -0.0095808 0.0390181 -0.0292941 -0.1068754 -1.1991241 -0.4178455 -0.1450506 -0.3728958 -0.6586692 -0.0773051 -0.0464571 -0.0299451 -0.5504113 -0.7271604 0.1843309 -0.0874586 0.1624756 -0.3663364 0.17949 -0.1571931 0.1231111 -0.6566554 -0.4440538 0.0224388 -0.0862755 -0.0380743 -0.7121744 -0.0749116 -0.108239 -0.1073474 -0.5104296 -0.3291674 -0.1074883 0.0763353 -0.0211003 -0.5813437 0.0543741 0.0852697 0.129596 -0.6996952 -0.5433962 -0.1347751 0.0103052 -0.0166325 -0.5125253 0.0857767 -0.2235353 -0.0351905 -0.9292815 0.3800995 -0.1235414 0.1260555 -0.0553258 0.1488626 -0.1193552 0.1810159 -0.0966531 0.4163552 0.0608577 0.0855282 0.0182187 0.0522758 0.4230523 0.1296307 0.107554 0.1424494 0.3002727 0.5808143 0.2978912 -0.0549737 0.0543326 0.1599078 0.0436877 -0.2362557 -0.1064142 0.2302884 0.155184 0.0324112 0.0309892 0.0690392 0.2832966 -0.1188782 -0.0774541 -0.1828599 0.4141872 0.8801538 0.2530202 0.2162183 0.0308057 0.4971242 -0.0835559 0.4743887 0.1859356 0.8820392 0.3488248 0.3573687 0.0437159 0.6258807 0.5994305 0.0131241 0.080091 0.0555897 -0.0133078 0.0216785 0.0362714 0.0081326 0.0522657 0.0257348 -0.033081 0.0171829 -0.02642 -0.0228869 0.0422639 0.0017305 0.0390802 -0.0254697 -0.0144908 -0.0065796 0.0363933 0.0050607 -0.1441054 0.016252 -0.0241194 -0.0074887 -0.0125675 0.0235707 -0.0328226 -0.0252902 -0.0106156 -0.0735897 -0.0772167 -0.0402589 -0.07008 -0.0231567 0.0768867 0.0023445 -0.0298637 0.0082982 0.0225437 0.0010228 -0.036623 -0.0186913 -0.0460543 -0.1047984 0.0252615 -0.0307221 -0.0088358 0.0401665 -0.02897 -0.0517128 -0.0101564 0.0167299 -0.0556243 0.031206 -0.0339556 0.0211355 0.0947879 0.0518342 -0.0718593 -0.0652726 -0.0735457 0.0029765 -0.0332954 0.0367906 0.0194836 0.0075375 0.4049959 -0.0826276 0.0097815 -0.0588149 0.0777835 -0.0072194 0.0190262 -0.0386904 0.2793632 0.3039795 -0.1367323 -0.0195049 -0.0753315 0.3234689 -0.0024801 -0.0214812 -0.0023192 0.3084861 0.1971841 0.0909926 -0.1040686 0.0220923 0.3238828 -0.0014892 -0.1279432 -0.065578 0.3493087 0.3275893 -0.0208711 0.0480516 -0.0306444 0.3795594 0.0356589 0.0416599 0.0495038 0.3619019 unknown
polarizability: 124.9517915|26.0404768|109.9830594|0.7077367|2.0835859|77.1763583 unknown
InChI: InChI=1S/C6H11IO5/c7-1-2-3(8)4(9)5(10)6(11)12-2/h2-6,8-11H,1H2
charge 0 multiplicity 1
23 atoms
I  -3.593694 -1.817452 -0.041191
O  -0.488538 1.324162 -0.540511
O  1.968288 -1.223491 1.220788
O  -0.217872 -2.395941 -1.010612
O  1.949063 0.949298 -1.722235
O  0.427019 1.049984 1.6952
C  1.426625 -0.887238 -0.125751
C  -0.097624 -1.206009 -0.156889
C  -1.040808 -0.063661 -0.659193
C  1.80289 0.602902 -0.31358
C  0.699092 1.458413 0.343564
C  -2.358457 0.034861 0.121907
H  1.917637 -1.485544 -0.912531
H  -0.406414 -1.449334 0.881728
H  -1.226353 -0.21595 -1.738369
H  2.785743 0.768405 0.156356
H  0.892243 2.541497 0.314951
H  -3.00233 0.826703 -0.284415
H  -2.179414 0.17985 1.197361
H  1.916094 -2.201121 1.367207
H  -1.151677 -2.73706 -0.950935
H  1.052139 1.227838 -2.053674
H  0.965145 0.233089 1.925124
