program: Gaussian 09
title: 000238674
version: EM64L-G09RevD.01
frameworkgroup: C1[X(C11H17O4P)]
method: RPBEPBE
basis: SDD
operation: Freq
keyword: #p
keyword: freq=noraman
keyword: PBEPBE/SDD
title: #p freq=noraman PBEPBE/SDD
converged: YES YES NO NO
title: Mulliken charges:
elementType: P O O O O C C C C C C C C C C C H H H H H H H H H H H H H H H H H
charge: 1.279501 -0.493405 -0.529475 -0.395217 -0.633011 -0.659679 0.522918 -0.418006 -0.350526 -0.221433 -0.240233 -0.223508 -0.240338 -0.231611 -0.667193 -0.647636 0.298277 0.234877 0.292929 0.240148 0.215828 0.224535 0.220348 0.363428 0.231720 0.233532 0.233189 0.204011 0.229381 0.235717 0.206753 0.225202 0.258978
chargesum: 0.00000
title: Mulliken charges with hydrogens summed into heavy atoms:
elementType: P O O O O C C C C C C C C C C C
charge: 1.279501 -0.493405 -0.529475 -0.031789 -0.633011 -0.361402 0.522918 -0.183129 -0.057598 0.234543 0.204651 0.008212 -0.006806 0.001578 0.001916 0.043296
polarizability: 1.99292378e+02 -1.18768972e+01 1.30322315e+02 -2.15806527e+00 6.67889252e+00 1.38291975e+02
1716.lowfreq: -11.3664 -4.7239 -0.0017 -0.0016 -0.0012 5.9974 14.0606 22.4257 36.5750
frequency: 13.2056 21.3881 36.1883 52.0430 63.7730 88.0474 99.6047 104.5267 122.4413 164.0276 179.1550 191.5570 223.8311 237.1407 244.4227 256.9563 271.2249 311.2003 338.7192 351.0211 392.9789 401.9198 428.9040 468.5250 527.3212 591.6028 610.5401 632.8947 661.7814 701.2165 706.3380 770.3221 803.2845 820.3691 825.5894 853.5562 867.9429 878.6610 926.5305 950.5291 977.2741 990.3074 1000.3873 1013.0416 1017.6345 1028.4370 1033.9226 1083.7280 1095.8698 1105.2127 1133.3541 1146.7338 1174.6663 1193.9866 1198.3524 1204.3092 1251.5343 1264.1482 1270.0344 1333.1487 1351.5561 1359.5891 1362.7023 1385.0623 1390.8981 1393.2761 1441.9945 1457.5038 1459.6609 1468.7740 1480.7069 1482.9564 1486.3041 1491.6638 1590.9466 1611.3783 2978.5771 2987.9073 2993.9115 3003.2428 3044.1775 3074.3494 3084.2879 3086.5935 3090.6131 3109.6655 3111.9473 3124.0704 3126.4617 3137.5797 3150.7297 3166.4431 3553.9950
redmass: 3.8553 3.6634 3.7845 3.3352 2.9978 2.9790 2.2127 3.8262 5.2424 5.0900 2.9799 3.7723 2.0078 2.9376 1.9901 1.6014 3.4301 2.1051 4.6410 2.4464 3.9793 2.8249 4.4015 6.7132 3.8674 5.3163 6.2558 6.1723 5.6142 2.2182 3.1806 2.1318 1.1215 3.1462 1.1396 1.2492 3.5231 3.8616 1.5523 4.8005 1.5310 3.8743 1.3905 3.0024 3.4850 2.3379 5.3627 1.6264 2.1538 2.2108 1.4093 1.5438 1.0607 1.2239 1.4843 1.2995 1.7939 1.1515 1.1174 1.2707 1.2192 1.2274 1.2213 6.2391 1.2317 1.2421 2.1534 1.0398 1.0409 1.0746 1.0486 2.2028 1.0569 1.0897 5.9030 5.9336 1.0551 1.0365 1.0370 1.0611 1.1080 1.1042 1.0971 1.0861 1.0980 1.1019 1.1032 1.0862 1.0890 1.0917 1.0960 1.1015 1.0663
irintensity: 1.0926 0.4830 0.5103 0.6339 0.4430 3.6234 1.8413 2.4432 1.1196 7.9617 19.0067 2.2112 18.3347 8.3001 4.1450 7.2828 6.6004 41.2426 7.7743 112.9040 9.7084 0.0403 24.1010 37.8256 16.6677 85.0314 0.3391 39.0019 81.0410 50.9738 68.9050 60.1378 5.1527 6.9876 6.2652 2.4456 135.5361 131.4022 25.5374 99.5371 2.7121 0.1611 1.9963 168.4836 172.0016 0.1032 23.9520 12.9660 12.1027 8.5094 3.3370 8.0154 0.5613 27.2831 5.1210 37.3701 8.5311 1.0234 0.3908 5.5270 8.0782 7.6539 25.7196 0.8510 26.0153 24.5633 13.0799 11.3114 13.2858 2.7650 6.9531 10.9991 13.0730 7.1081 1.8259 0.3067 27.5933 21.1708 29.3218 40.3715 14.0097 8.1032 38.2296 4.2042 30.1169 31.9864 25.7618 2.6221 1.6374 6.5986 24.1815 27.2898 20.7701
temp: 298.150 k
press: 1.00000 atm
elementType: 15 8 8 8 8 6 6 6 6 6 6 6 6 6 6 6 1 1 1 1 1 1 1 1 1 1 1 1 1 1 1 1 1
symmnumber: 1
zpe: 692320.1 jmol-1
zpe.correction: 0.263691 hartree
zpe.thermalcorrener: 0.282478 hartree
zpe.thermalcorrenthalpy: 0.283422 hartree
zpe.thermalcorrgfe: 0.213805 hartree
zpe.sumelectzpe: -1070.223521 hartree
zpe.sumelectthermal: -1070.204733 hartree
zpe.sumelectthermalent: -1070.203789 hartree
zpe.sumelectthermalfe: -1070.273406 hartree
dipole: -1.4429 -0.2005 -3.0368
dipole: 3.3681
quadrupole: -89.4474 -100.4456 -104.0661
quadrupole: 0.0620 -6.7930 -3.0711
quadrupole: 8.5390 -2.4592 -6.0797 0.0620 -6.7930 -3.0711
hfenergy: -1070.4872114 hartree
pointgroup: C01 [X(C11H17O4P1)]
dipole: -0.4542504 -0.4518952 1.1599169 debye
polarizability: 193.5116916|22.7229213|132.9899381|3.9790088|2.6332995|141.4050384 unknown
InChI: InChI=1S/C11H17O4P/c1-3-14-16(13,15-4-2)11(12)10-8-6-5-7-9-10/h5-9,11-12H,3-4H2,1-2H3
charge 0 multiplicity 1
33 atoms
P  1.319499 0.071089 -0.458326
O  2.768593 1.021125 -0.332618
O  1.662523 -1.412431 0.388623
O  0.11309 2.280326 0.700216
O  0.908261 -0.06894 -1.992909
C  0.047648 0.820067 0.783684
C  -1.345297 0.25299 0.607868
C  -2.06066 -0.200923 1.744041
C  -1.976605 0.239717 -0.665641
C  3.300846 1.390852 1.011824
C  2.197573 -2.576682 -0.380263
C  -3.391811 -0.654332 1.617367
C  -3.30975 -0.208494 -0.787817
C  -4.020862 -0.653951 0.350846
C  4.630695 2.096075 0.758373
C  1.058824 -3.409517 -0.973913
H  0.44911 0.576145 1.778609
H  -1.575659 -0.193682 2.727536
H  -1.414538 0.53587 -1.559568
H  2.575052 2.063872 1.507093
H  3.435229 0.472901 1.617617
H  2.885977 -2.217809 -1.169143
H  2.774921 -3.140172 0.372317
H  -0.41112 2.588884 -0.083397
H  -3.936166 -1.003981 2.501353
H  -3.78931 -0.22244 -1.772645
H  -5.054356 -1.004026 0.251584
H  5.079461 2.416544 1.717242
H  5.337577 1.422527 0.244814
H  4.477476 2.987059 0.12658
H  1.467522 -4.321773 -1.448897
H  0.350774 -3.715903 -0.184571
H  0.51488 -2.829686 -1.738581
