program: Gaussian 09
title: 000238654
version: EM64L-G09RevD.01
frameworkgroup: C1[X(C9H7N3O7)]
method: RPBEPBE
basis: SDD
operation: Freq
keyword: #pfreq=noraman
keyword: PBEPBE/SDD
title: #p freq=noraman PBEPBE/SDD
converged: YES YES NO NO
title: Mulliken charges:
elementType: O O O O O O O N N N C C C C C C C C C H H H H H H H
charge: -0.265273 -0.176657 -0.194381 -0.182873 -0.177191 -0.457215 -0.202240 -0.426613 0.021603 0.020262 0.371310 -0.493445 -0.507103 0.438446 0.421785 -0.503349 0.200172 -0.387115 0.186584 0.273150 0.338794 0.341334 0.379326 0.288985 0.288752 0.402954
chargesum: 0.00000
title: Mulliken charges with hydrogens summed into heavy atoms:
elementType: O O O O O O O N N N C C C C C C C C C
charge: -0.265273 -0.176657 -0.194381 -0.182873 -0.177191 -0.054261 -0.202240 -0.047287 0.021603 0.020262 0.371310 -0.220296 -0.168310 0.438446 0.421785 -0.162014 0.200172 0.190622 0.186584
polarizability: 2.16345884e+02 -8.27892788e-02 1.81334524e+02 -1.55165994e+00 -9.19594797e-01 5.91487408e+01
1716.lowfreq: -6.7752 -2.7094 -0.0009 -0.0007 -0.0005 2.7863 5.4186 33.1038 48.7039
frequency: 1.1332 33.0993 48.7029 51.8653 54.2832 60.4141 94.2388 136.5987 147.5155 156.0982 189.0121 225.1638 239.7290 277.9747 309.5073 337.8622 352.6033 443.8445 462.8121 477.6618 496.8072 504.6416 528.5112 548.7869 592.3222 599.2004 643.3232 649.8698 683.4832 692.0834 699.0883 724.7840 747.4921 756.8695 826.8279 866.7510 918.5077 941.1739 972.6162 977.7369 987.1782 1001.9129 1071.1562 1075.8066 1086.8515 1107.8888 1173.9409 1206.1935 1213.2262 1216.6631 1236.9995 1268.5461 1304.8203 1334.7396 1379.7289 1384.7953 1399.1080 1435.6066 1452.8379 1458.2285 1503.8079 1574.3923 1609.0221 1618.3808 1693.1912 2996.9744 3036.9453 3165.6914 3175.8131 3192.9853 3537.0008 3553.9610
redmass: 7.8774 8.3141 12.1442 10.7074 11.8311 6.3935 5.5597 12.4694 9.3899 4.2429 4.5293 3.8437 9.0976 8.0627 11.3842 12.3606 11.5464 8.5547 5.1272 3.8276 2.2283 9.2304 5.9841 4.3577 3.2128 1.3861 4.9779 1.4676 12.2448 9.6822 2.6036 8.6123 6.1359 10.8401 5.2915 11.4662 7.1407 1.5983 1.4977 2.0267 6.1364 1.4474 1.4915 1.9208 2.8402 2.0052 5.1456 14.0800 1.0825 5.8859 1.5020 1.7500 2.4008 1.7169 10.1085 9.4573 5.5907 5.6137 2.0224 1.3524 2.2793 8.7541 8.3178 8.0906 9.4351 1.0604 1.0996 1.0919 1.0924 1.0931 1.0647 1.0780
irintensity: 2.3893 8.5193 0.2884 0.3168 0.3556 0.8331 3.4354 0.5603 8.6670 7.2764 0.0692 1.7184 2.2432 0.9057 5.9139 0.5166 4.0897 8.2513 2.2420 14.9813 33.2234 5.2573 20.2133 38.9552 6.3800 18.2073 1.5818 187.7749 40.4091 26.7536 71.4190 0.0302 13.5404 4.4917 17.0991 17.2653 34.0806 14.7256 25.8927 2.1588 0.1251 13.0953 22.7404 240.2172 34.0008 39.0771 0.3852 307.5923 0.1058 148.2811 10.4407 6.4277 52.1392 9.2795 53.4110 97.4465 1.6697 10.3476 151.9917 97.0155 299.0891 51.0007 97.6621 8.3528 287.5594 17.9315 2.6318 4.3492 18.4896 25.1482 42.5247 67.4193
temp: 298.150 k
press: 1.00000 atm
elementType: 8 8 8 8 8 8 8 7 7 7 6 6 6 6 6 6 6 6 6 1 1 1 1 1 1 1
symmnumber: 1
zpe: 442172.0 jmol-1
zpe.correction: 0.168414 hartree
zpe.thermalcorrener: 0.185755 hartree
zpe.thermalcorrenthalpy: 0.186700 hartree
zpe.thermalcorrgfe: 0.117067 hartree
zpe.sumelectzpe: -1036.454733 hartree
zpe.sumelectthermal: -1036.437392 hartree
zpe.sumelectthermalent: -1036.436448 hartree
zpe.sumelectthermalfe: -1036.506081 hartree
dipole: -4.2552 2.3773 -0.2556
dipole: 4.8809
quadrupole: -129.1065 -132.2906 -104.5186
quadrupole: -8.2646 1.2968 -0.1569
quadrupole: -7.1346 -10.3187 17.4533 -8.2646 1.2968 -0.1569
hfenergy: -1036.6231475 hartree
pointgroup: C01 [X(C9H7N3O7)]
dipole: -1.5108453 -1.116698 -0.3973205 debye
dipolederiv: -0.7709102 0.1715604 0.0782911 -0.1496858 -0.7766379 -0.1610859 -0.0493512 -0.1727991 -0.4170714 -0.5017935 -0.0713822 -0.0353714 0.0023181 -0.6647669 -0.2275034 0.0002363 -0.2282721 -0.3150652 -0.5571159 -0.0784621 -0.041612 -0.1120733 -0.6467548 -0.2141593 -0.0570594 -0.2117969 -0.318868 -0.8141373 -0.0002404 -0.0012535 -0.0757034 -0.441052 -0.114388 -0.0397037 -0.113778 -0.2660446 -0.7162084 0.1251069 0.0575856 0.193484 -0.5109177 -0.1498932 0.0893531 -0.1482307 -0.2763505 -0.6179359 0.2552944 0.0954098 0.3455595 -0.9298672 -0.1851064 0.133892 -0.1879091 -0.4959495 -1.2013716 0.0884803 0.0325576 -0.1535028 -0.5092259 -0.0720868 -0.0589654 -0.0738557 -0.3403485 -1.1632921 -0.266474 -0.0916134 -0.4650689 -0.6080129 -0.0700732 -0.1670731 -0.0795154 -0.4512296 1.3349246 0.2780484 0.1390705 0.2966138 1.0882194 0.4491406 0.1479843 0.4492296 0.4008114 1.0695201 -0.1582032 -0.0710311 -0.2077866 1.3176088 0.5593991 -0.0934806 0.5541146 0.4504007 -0.1184012 -0.0555572 -0.0280448 0.034007 -0.264297 -0.1310956 -0.0006739 -0.1280709 -0.0433186 0.0085416 -0.1653281 -0.0792814 0.0112352 0.0354801 0.0655966 0.0185942 0.0582325 -0.0635404 0.0457095 0.1193954 0.0599686 -0.0057066 -0.0025051 0.0236553 -0.0066305 0.018652 -0.0392345 -0.2330114 -0.0747877 -0.03745 -0.0913665 -0.1930876 -0.131608 -0.0464687 -0.1302489 0.0087302 -0.1836781 0.0638931 0.030726 0.0605057 -0.318401 -0.199113 0.0339137 -0.197482 -0.0095442 -0.1672711 0.0636702 0.0312459 0.0795527 0.1177062 0.0908394 0.0391284 0.0893391 -0.022286 1.5619899 0.0647097 0.0012538 0.3935093 0.9802862 0.2817836 0.1356185 0.3061709 0.3364628 0.51716 -0.0768497 -0.0344896 -0.2841464 -0.0653503 -0.1307481 -0.1228579 -0.1380653 0.2306256 1.6328509 -0.1616589 -0.0586579 0.0000042 1.204543 0.3676728 0.002561 0.3750846 0.3581533 0.0837055 -0.0540086 -0.0261619 -0.0933378 0.1288616 -0.0145821 -0.0528436 -0.0118065 0.1527768 0.2327952 0.0132297 0.0066021 0.0004162 0.1483429 -0.0098255 0.0070169 -0.0075028 0.1617685 0.1614295 0.0132779 0.0059529 0.0097732 0.1880397 0.0015489 0.005002 0.001447 0.1857758 0.3269717 0.0734888 0.0290695 0.1722389 0.2290478 -0.0404648 0.0620259 -0.0376708 0.3099903 -0.034061 -0.0299946 -0.0287709 0.0671885 0.0532607 0.0624503 -0.0260106 0.0567005 0.0630689 -0.0317495 -0.0437072 0.0003487 0.0310204 0.1176635 -0.0130279 0.0691011 -0.0035431 -0.0025147 0.1353386 -0.0935014 -0.0343442 -0.0590487 0.3218164 -0.0373252 -0.0233089 -0.0384233 0.4028015 unknown
polarizability: 215.5269153|4.9329307|160.1776612|2.0568725|47.1475618|81.1245717 unknown
InChI: InChI=1S/C9H7N3O7/c13-8(14)4-10-9(15)5-1-6(11(16)17)3-7(2-5)12(18)19/h1-3,10,13H,4H2
charge 0 multiplicity 1
26 atoms
O  -1.78434 2.029029 0.873739
O  2.926989 3.061544 1.521424
O  1.132859 -3.154908 -1.533285
O  4.557519 1.624806 0.82316
O  3.33606 -2.625375 -1.259479
O  -4.154511 -1.898798 -0.6374
O  -6.093263 -0.690112 -0.179354
N  -2.49537 -0.017357 0.061167
N  3.324243 1.962398 0.982874
N  2.080293 -2.370368 -1.143169
C  -0.072036 0.441625 0.21423
C  0.315486 -0.781799 -0.379323
C  0.923699 1.344427 0.659121
C  2.280002 1.00595 0.507512
C  1.687996 -1.077262 -0.51264
C  2.699619 -0.203553 -0.077476
C  -1.509606 0.878437 0.407525
C  -3.903793 0.350623 0.220545
C  -4.851611 -0.757391 -0.204071
H  -0.395564 -1.522895 -0.756319
H  0.621134 2.293544 1.112079
H  3.758522 -0.449514 -0.188808
H  -2.306559 -0.956661 -0.293119
H  -4.14319 1.258883 -0.365479
H  -4.1260 0.615594 1.272676
H  -4.79098 -2.612666 -0.909028
