program: Gaussian 09
title: 000238644
version: EM64L-G09RevD.01
frameworkgroup: C1[X(C13H14N2O2)]
method: RPBEPBE
basis: SDD
operation: Freq
keyword: #p
keyword: freq=noraman
keyword: PBEPBE/SDD
title: #p freq=noraman PBEPBE/SDD
converged: YES YES NO NO
title: Mulliken charges:
elementType: O O N N C C C C C C C C C C C C C H H H H H H H H H H H H H H
charge: -0.450407 -0.263746 -0.471416 -0.004602 0.377307 -0.558052 -0.500101 -0.439314 -0.421581 -0.239132 0.469266 -0.328537 -0.433027 -0.385651 -0.307468 0.257897 0.102374 0.244652 0.239279 0.256693 0.244757 0.237825 0.219646 0.227231 0.226671 0.301952 0.255575 0.220652 0.269178 0.272192 0.379887
chargesum: 0.00000
title: Mulliken charges with hydrogens summed into heavy atoms:
elementType: O O N N C C C C C C C C C C C C C
charge: -0.070520 -0.263746 -0.169464 -0.004602 0.377307 -0.074121 0.001349 0.018156 0.032322 -0.239132 0.469266 -0.072962 -0.212375 -0.116473 -0.035276 0.257897 0.102374
polarizability: 2.43898673e+02 -2.38126139e+00 1.41833688e+02 -9.25101328e+00 1.40872941e+01 1.10302290e+02
1716.lowfreq: -7.8404 -0.0005 0.0005 0.0006 4.7296 8.1810 27.8192 43.7802 56.9848
frequency: 27.1716 43.5248 56.9636 84.1160 92.0001 114.0358 147.3241 159.5499 186.6708 214.5109 270.8796 282.1441 342.0775 383.0280 390.4600 417.1528 426.9290 481.5132 496.2229 507.7362 529.0586 558.3284 578.7652 591.2334 619.3673 647.3291 684.2352 718.1176 742.7463 755.2693 806.4969 824.9961 828.1140 844.4859 852.2842 900.6153 918.7859 953.4091 975.3212 985.7385 990.4534 1014.0523 1017.2328 1029.6823 1048.7724 1082.6018 1096.8743 1133.2903 1152.4529 1174.0069 1202.6447 1208.8662 1226.8612 1258.0530 1291.0730 1292.4565 1308.1038 1316.6654 1321.2257 1322.6989 1323.8735 1371.0460 1438.9768 1463.9277 1467.5675 1472.6749 1483.5321 1490.8587 1518.7331 1576.6218 1626.1684 1642.2900 2177.6175 3006.0931 3007.5905 3012.3798 3027.9818 3065.3408 3070.7132 3083.8400 3097.9831 3118.4553 3150.2484 3171.3999 3176.6341 3536.3366 3547.1704
redmass: 2.8648 5.4222 5.4520 6.2711 4.9460 5.4776 3.8162 3.9308 3.5110 5.4189 4.0955 3.2725 4.1028 1.2167 3.3126 3.0139 4.5857 6.9411 5.2873 3.2072 5.3061 2.3116 1.2331 3.6555 6.3023 4.9106 3.5930 4.2132 2.4436 4.6348 1.9751 1.8670 1.7355 1.7335 2.1851 2.2491 1.9980 2.2225 1.3570 1.4614 3.6331 3.0010 2.6516 1.7490 2.5162 2.1110 2.7081 1.3602 1.5875 1.5734 1.2014 1.4710 1.4132 1.4297 1.2865 1.5136 1.4248 1.5323 1.3991 2.3662 1.6595 4.3210 3.9310 1.3134 1.0806 1.0861 1.2721 1.1893 2.9763 4.7512 6.4529 8.1897 12.6624 1.0590 1.0631 1.0641 1.0634 1.0995 1.1037 1.1043 1.1042 1.0899 1.0885 1.0954 1.0952 1.0641 1.0769
irintensity: 0.4437 1.4003 1.1341 0.3355 0.5708 2.4370 1.0701 0.3986 1.8228 0.9420 1.9205 1.3184 4.6880 110.7406 12.9347 6.5527 5.1403 4.2453 8.9881 24.4000 9.4566 5.0500 81.3660 21.9235 5.7714 27.2962 65.2073 1.0497 0.9200 21.3762 5.1724 8.3253 1.3494 58.2723 8.9953 1.2850 3.4992 9.1697 1.2805 16.8264 125.6561 200.1771 59.9691 0.6161 4.0280 3.9389 1.7495 15.1329 227.0348 3.5707 9.7955 16.7571 12.4812 18.8139 35.3798 11.6226 17.1258 4.1513 12.9299 145.2530 41.0546 183.1876 6.4107 25.4228 0.1570 12.9717 9.9573 9.3404 168.1421 23.7233 527.8741 226.7504 4.8293 16.9173 40.6480 27.0312 13.0262 17.9182 10.4515 27.7364 54.2286 15.9162 2.3176 12.5090 2.5791 51.9045 37.6810
temp: 298.150 k
press: 1.00000 atm
elementType: 8 8 7 7 6 6 6 6 6 6 6 6 6 6 6 6 6 1 1 1 1 1 1 1 1 1 1 1 1 1 1
symmnumber: 1
zpe: 646299.5 jmol-1
zpe.correction: 0.246162 hartree
zpe.thermalcorrener: 0.261820 hartree
zpe.thermalcorrenthalpy: 0.262764 hartree
zpe.thermalcorrgfe: 0.201938 hartree
zpe.sumelectzpe: -762.498578 hartree
zpe.sumelectthermal: -762.482921 hartree
zpe.sumelectthermalent: -762.481976 hartree
zpe.sumelectthermalfe: -762.542802 hartree
dipole: 4.6362 -5.2636 0.2551
dipole: 7.0189
quadrupole: -91.7678 -109.3930 -100.9402
quadrupole: -1.8519 7.5598 8.0409
quadrupole: 8.9326 -8.6927 -0.2399 -1.8519 7.5598 8.0409
hfenergy: -762.7447403 hartree
pointgroup: C01 [X(C13H14N2O2)]
dipole: 1.9201899 -1.9115588 0.5333918 debye
polarizability: 242.9992098|-1.0015391|146.5142874|-14.9837268|4.2732255|106.5211528 unknown
InChI: InChI=1S/C13H14N2O2/c14-9-13(7-1-2-8-13)15-11-5-3-10(4-6-11)12(16)17/h3-6,15-16H,1-2,7-8H2
charge 0 multiplicity 1
31 atoms
O  -4.960039 -1.112251 0.248135
O  -4.710903 1.095348 0.929165
N  1.392244 -0.68072 -0.597083
N  2.190949 2.430196 -1.983989
C  2.493135 0.283833 -0.399861
C  3.838953 -0.43906 -0.74247
C  2.666973 0.681373 1.121959
C  4.187181 -1.199264 0.556436
C  3.864099 -0.162386 1.664922
C  2.313029 1.479309 -1.273254
C  0.037229 -0.473067 -0.328696
C  -0.479381 0.774453 0.137887
C  -0.871991 -1.557829 -0.531981
C  -1.851088 0.914312 0.398858
C  -2.23953 -1.406459 -0.270953
C  -2.749896 -0.167322 0.205344
C  -4.181314 0.038444 0.499349
H  4.609435 0.324325 -0.951797
H  3.749008 -1.073934 -1.643017
H  1.73159 0.460926 1.660727
H  2.857726 1.764246 1.220314
H  5.240039 -1.529555 0.574132
H  3.550713 -2.097222 0.664954
H  3.624563 -0.643053 2.628712
H  4.741335 0.489512 1.831262
H  1.641853 -1.548384 -1.073567
H  0.178053 1.638181 0.266757
H  -0.489351 -2.520342 -0.894369
H  -2.25315 1.870586 0.749818
H  -2.929057 -2.24055 -0.427798
H  -5.906006 -0.897645 0.466301
