program: Gaussian 09
title: 000238682
version: EM64L-G09RevD.01
frameworkgroup: C1[X(C20H18O8)]
method: RPBEPBE
basis: SDD
operation: Freq
keyword: #pfreq=noraman
keyword: PBEPBE/SDD
title: #p freq=noraman PBEPBE/SDD
converged: YES YES NO NO
title: Mulliken charges:
elementType: O O O O O O O O C C C C C C C C C C C C C C C C C C C C H H H H H H H H H H H H H H H H H H
charge: -0.302122 -0.302132 -0.242945 -0.242952 -0.226805 -0.226805 -0.239621 -0.239604 -0.119157 -0.119206 0.230023 0.230022 0.231966 0.231940 0.213895 0.213908 -0.328693 -0.328667 -0.336801 -0.336798 -0.221841 -0.221860 -0.222055 -0.222059 -0.500579 -0.500581 -0.220570 -0.220568 0.306119 0.306151 0.276601 0.276613 0.268829 0.268828 0.234190 0.234192 0.234209 0.234210 0.239863 0.243917 0.248313 0.248304 0.243927 0.239868 0.233267 0.233266
chargesum: 0.00000
title: Mulliken charges with hydrogens summed into heavy atoms:
elementType: O O O O O O O O C C C C C C C C C C C C C C C C C C C C
charge: -0.302122 -0.302132 -0.242945 -0.242952 -0.226805 -0.226805 -0.239621 -0.239604 0.186962 0.186945 0.230023 0.230022 0.231966 0.231940 0.213895 0.213908 -0.052092 -0.052054 -0.067972 -0.067970 0.012350 0.012332 0.012154 0.012150 0.231514 0.231518 0.012697 0.012698
polarizability: 2.99847418e+02 -3.89782607e-03 2.00813927e+02 7.76084919e-03 3.03130703e+00 2.17831997e+02
1716.lowfreq: -4.7701 -0.0012 -0.0007 -0.0004 0.5351 3.9540 11.4519 13.4289 17.1525
frequency: 11.4039 13.1814 17.1523 21.2188 31.9731 32.3446 48.2800 54.6155 60.0582 67.9496 76.6521 92.2559 98.8950 105.8680 110.9529 139.2607 149.2527 166.1009 166.6965 215.1248 227.1623 239.6467 253.9797 279.5639 304.1498 304.3532 316.6271 348.4185 383.6016 389.8428 402.7511 402.8298 438.5116 442.3685 468.5267 486.4957 553.8953 613.5095 613.5138 625.3800 654.0732 661.8903 674.8816 676.3227 676.4368 699.5872 702.3559 717.3978 718.7736 788.5022 794.8448 795.6222 807.6801 845.3534 864.9348 866.5424 872.2824 940.2215 952.7197 956.8482 957.4437 973.4469 989.6155 990.4633 995.8457 997.2005 997.6384 1009.7856 1009.9716 1011.3696 1018.9798 1035.8062 1043.3277 1086.9162 1087.6621 1113.8614 1113.8644 1132.5909 1149.8883 1151.5223 1156.0173 1174.5600 1174.6323 1183.1549 1183.6665 1191.6094 1228.7019 1240.7778 1272.8891 1291.0506 1313.1967 1317.7050 1318.9913 1359.0643 1390.3633 1390.4063 1422.8561 1422.9930 1438.5531 1438.5889 1453.7405 1453.8198 1461.3702 1461.5287 1477.7925 1478.0586 1586.5966 1586.6149 1611.4179 1611.5281 1634.2674 1635.4396 1640.9603 1641.0267 3008.5901 3008.7043 3042.7722 3051.6136 3112.6663 3112.6819 3131.6602 3131.6623 3144.7788 3144.7827 3156.7742 3156.7745 3157.5613 3157.5880 3168.5527 3168.6229 3182.4008 3182.4304
redmass: 6.2105 5.1749 5.3579 4.9126 4.3616 5.9476 4.3626 6.9520 4.7612 6.7287 2.0168 1.1123 1.7978 5.8704 6.3025 4.4195 4.8781 5.1130 4.7230 7.9770 5.4689 4.9273 5.8308 6.9599 9.4797 8.5269 6.0420 6.8041 8.8221 7.8333 2.8214 2.8275 3.8595 3.8713 7.4519 7.9059 4.5343 6.4451 6.4416 6.5762 6.3404 6.8104 5.1001 6.4679 5.1904 1.6329 1.6210 7.0820 7.7246 7.8158 2.1193 2.1243 8.2664 7.8546 1.2445 1.2437 8.0192 6.8612 8.2780 1.4365 1.4203 5.6103 6.0306 6.2075 4.4664 1.3917 1.4243 1.3836 1.3314 4.7255 3.4338 2.3411 2.9338 1.6060 1.6480 1.2666 1.2659 3.9703 1.6474 1.4338 2.2465 1.0599 1.0590 1.4225 1.1394 1.9249 2.9475 3.4541 1.5384 1.4490 1.5923 1.3101 1.3600 1.6486 9.9132 9.9245 1.1960 1.2030 2.2466 2.2456 1.0497 1.0497 1.0503 1.0505 2.2643 2.2713 6.4406 6.4416 6.0287 6.0495 10.7552 9.7555 11.8318 10.3923 1.0294 1.0295 1.0843 1.0820 1.1049 1.1049 1.0857 1.0857 1.0892 1.0892 1.0941 1.0941 1.1050 1.1050 1.0985 1.0985 1.0973 1.0972
irintensity: 0.1556 1.4308 0.1840 3.0386 0.1435 0.7344 0.9296 1.1650 2.2078 1.6028 0.0007 0.1946 0.5588 0.8007 0.1453 1.5318 1.0836 0.7949 2.4782 1.7182 5.1179 0.0001 3.1805 27.7915 5.3516 2.2348 58.2667 1.5700 1.7650 1.4426 0.0077 0.0676 1.7707 0.5251 9.3508 8.8107 27.5986 0.5348 0.5472 12.5911 3.0767 3.1839 35.4335 14.6465 6.4100 137.4293 31.5649 8.2607 3.2729 27.1219 37.0230 7.2946 13.0845 11.9745 0.0262 0.5078 0.6053 0.9299 50.2961 2.6512 0.5798 44.2818 1.3058 4.3447 25.8002 0.0439 4.3462 4.4095 0.0620 154.2288 268.9952 81.7287 330.7532 11.7407 18.6837 0.0456 0.0597 2.4964 71.0137 6.3810 274.1179 0.9294 1.3181 136.5833 29.1483 26.5581 101.1825 287.6144 127.3990 170.4638 7.3131 0.0017 7.5599 6.3431 0.0286 5.3262 11.4232 27.1781 13.9280 19.9003 18.0162 11.3141 0.0482 22.2723 10.6156 0.0378 26.1033 3.6343 7.3099 25.5491 1.2823 245.6857 367.7135 108.2075 29.9861 32.1197 35.4086 8.5792 23.6568 18.6638 0.4883 0.5985 3.7103 16.0934 20.1501 9.6590 24.0216 0.2473 11.8500 28.9475 4.6490 6.6412
temp: 298.150 k
press: 1.00000 atm
elementType: 8 8 8 8 8 8 8 8 6 6 6 6 6 6 6 6 6 6 6 6 6 6 6 6 6 6 6 6 1 1 1 1 1 1 1 1 1 1 1 1 1 1 1 1 1 1
symmnumber: 1
zpe: 898236.3 jmol-1
zpe.correction: 0.342120 hartree
zpe.thermalcorrener: 0.369561 hartree
zpe.thermalcorrenthalpy: 0.370505 hartree
zpe.thermalcorrgfe: 0.277243 hartree
zpe.sumelectzpe: -1372.701688 hartree
zpe.sumelectthermal: -1372.674247 hartree
zpe.sumelectthermalent: -1372.673303 hartree
zpe.sumelectthermalfe: -1372.766565 hartree
dipole: -2.3482 0.0005 -0.0024
dipole: 2.3482
quadrupole: -131.3124 -134.1438 -165.6948
quadrupole: 0.0032 -0.0060 -6.8834
quadrupole: 12.4046 9.5731 -21.9778 0.0032 -0.0060 -6.8834
hfenergy: -1373.0438077 hartree
pointgroup: C01 [X(C20H18O8)]
dipole: 0.0002092 0.9238564 -0.0016902 debye
polarizability: 202.5404572|-0.0436084|299.8472953|-5.9656849|-0.0960237|216.1055906 unknown
InChI: InChI=1S/C20H18O8/c1-25-19(23)15(27-17(21)13-9-5-3-6-10-13)16(20(24)26-2)28-18(22)14-11-7-4-8-12-14/h3-12,15-16H,1-2H3
charge 0 multiplicity 1
46 atoms
O  -1.269275 -0.811459 -0.564959
O  1.26933 -0.809007 0.566592
O  -2.125295 -3.332063 -1.753286
O  2.129327 -3.324859 1.759728
O  -1.592404 -3.991274 0.418358
O  1.594584 -3.991401 -0.409211
O  -0.298741 -0.105221 -2.577017
O  0.299254 -0.099809 2.577822
C  -0.461512 -2.046995 -0.61288
C  0.462738 -2.045172 0.617281
C  -1.432866 -3.229474 -0.561792
C  1.435116 -3.226938 0.568881
C  -1.073212 0.114314 -1.619177
C  1.073246 0.118463 1.619309
C  -1.894995 1.338322 -1.421161
C  1.893462 1.343026 1.418233
C  -2.672993 1.544631 -0.25159
C  2.670422 1.547811 0.247703
C  -1.871735 2.323378 -2.443605
C  1.869773 2.330153 2.438669
C  -3.422614 2.731379 -0.112093
C  3.418594 2.735121 0.105254
C  -2.625383 3.50517 -2.299258
C  2.621992 3.512495 2.291384
C  -3.134197 -4.419739 -1.823082
C  3.139715 -4.411027 1.831542
C  -3.401825 3.711124 -1.133318
C  3.3974 3.71693 1.124486
H  0.116462 -2.068609 -1.55474
H  -0.115249 -2.065206 1.559181
H  -2.677189 0.782692 0.532428
H  2.67498 0.784257 -0.53474
H  -1.25993 2.143365 -3.333692
H  1.258769 2.151263 3.329533
H  -4.020073 2.894228 0.791187
H  4.015251 2.896796 -0.798767
H  -2.608829 4.264029 -3.088753
H  2.605126 4.27295 3.079335
H  -3.582933 -4.318625 -2.82028
H  -3.887226 -4.289283 -1.028132
H  -2.639418 -5.397734 -1.703096
H  2.646006 -5.39003 1.715427
H  3.891409 -4.282173 1.03507
H  3.589778 -4.306137 2.827751
H  -3.986213 4.631253 -1.020582
H  3.980671 4.637485 1.009465
