program: Gaussian 09
title: 000238643
version: EM64L-G09RevD.01
frameworkgroup: C1[X(C12H15N3O3)]
method: RPBEPBE
basis: SDD
operation: Freq
keyword: #p
keyword: freq=noraman
keyword: PBEPBE/SDD
title: #p freq=noraman PBEPBE/SDD
converged: YES YES NO NO
title: Mulliken charges:
elementType: O O O N N N C C C C C C C C C C C C H H H H H H H H H H H H H H H
charge: -0.249123 -0.230405 -0.226888 -0.480669 -0.607131 0.017744 0.261644 -0.569200 -0.524003 -0.465726 -0.403009 0.136740 0.447709 -0.428321 -0.289398 -0.347139 -0.405400 0.384272 0.242911 0.256798 0.275984 0.242841 0.216781 0.231967 0.225473 0.223814 0.303418 0.339475 0.345793 0.230523 0.270132 0.285967 0.286425
chargesum: 0.00000
title: Mulliken charges with hydrogens summed into heavy atoms:
elementType: O O O N N N C C C C C C C C C C C C
charge: -0.249123 -0.230405 -0.226888 -0.177252 0.078137 0.017744 0.261644 -0.069491 -0.005177 -0.016978 0.046278 0.136740 0.447709 -0.197797 -0.019265 -0.061172 -0.118975 0.384272
polarizability: 2.66690008e+02 1.10865295e+00 1.39114993e+02 4.55692594e+00 2.09243013e+01 1.24659408e+02
1716.lowfreq: -42.4138 -11.1339 -0.0009 -0.0008 -0.0004 4.1203 7.8909 40.8966 47.9270
frequency: -41.7962 40.5918 47.8081 55.4235 90.1770 99.5495 123.8224 138.8807 192.8211 199.8576 257.3008 280.6298 292.7103 335.4787 358.3335 385.5837 420.4009 438.4517 483.3295 507.2732 513.1657 569.9628 590.0963 595.9485 608.1203 617.3027 636.6871 652.6937 667.0648 715.7651 729.8296 749.5841 769.0032 788.2622 817.3684 824.6611 842.9704 845.0347 894.3920 931.6586 961.8962 977.2347 987.1212 991.8154 1003.6019 1032.3217 1041.5715 1054.7604 1081.8083 1099.3147 1110.9712 1128.4796 1182.5580 1188.3849 1205.3613 1222.3685 1233.8639 1251.5354 1279.1982 1284.3871 1303.9893 1310.7482 1312.6601 1324.9171 1344.0134 1347.6386 1380.6250 1445.2374 1464.0514 1470.2997 1479.6036 1484.8377 1493.0205 1502.3514 1563.2001 1586.7487 1621.9697 1637.1531 2988.3735 3007.5112 3013.5386 3029.0536 3053.5906 3070.1699 3080.1730 3095.2078 3124.5252 3166.7258 3180.9721 3185.4737 3513.5833 3515.5200 3669.3964
redmass: 1.8923 5.9594 7.7947 7.5098 4.9336 4.7501 4.7997 3.5461 5.7481 2.8782 5.9346 3.6223 4.6497 4.5434 3.6907 2.9889 3.0288 4.7670 1.3192 6.5283 2.8026 2.9764 2.2098 1.6703 1.1794 4.0780 3.7782 4.9780 4.7592 4.4626 4.6951 2.7965 3.0082 1.9910 2.1650 1.3069 2.7673 1.7770 2.5215 2.0262 2.2826 1.3207 1.3458 3.0678 4.0374 1.7154 1.8142 1.9200 2.3955 2.9965 2.2088 1.6612 1.4970 1.3953 1.3630 1.5321 3.2141 1.3668 1.3221 1.5663 1.3814 1.3720 1.8097 1.5014 3.3020 5.6185 4.3325 4.1503 1.1528 1.1013 1.1136 1.6000 1.2448 2.1447 1.4497 5.5516 5.9093 4.4397 1.0653 1.0614 1.0613 1.0622 1.0982 1.1033 1.1033 1.1043 1.0902 1.0883 1.0944 1.0967 1.0672 1.0529 1.1045
irintensity: 0.0913 2.1522 4.5529 2.8110 0.5244 1.7802 0.7231 0.8567 2.3622 3.5032 10.7963 1.7453 2.0640 4.6546 10.0574 0.4013 1.7165 2.3208 56.1993 0.6737 1.1065 24.9706 12.0081 165.2820 123.3858 9.2776 3.6416 14.0445 21.9463 13.3101 5.7474 14.7849 13.4193 0.3676 1.2117 14.8645 10.9138 56.2194 1.9702 3.1820 5.1399 3.5424 2.2039 0.6057 2.3644 40.3710 4.5014 5.3149 1.2197 15.6980 11.8939 23.7426 285.8737 12.6563 4.5926 109.0471 449.3348 11.0752 9.0045 21.4514 13.3331 5.0815 40.1305 12.0226 150.7385 65.7972 114.2124 2.9258 24.5942 6.7171 18.3872 4.3247 35.1488 101.9042 114.3918 12.0786 334.2115 265.1866 26.4306 40.2188 26.1393 16.3965 17.6155 10.0022 27.0711 42.6877 11.5862 3.1314 0.6348 7.4925 31.6594 56.5221 51.0683
temp: 298.150 k
press: 1.00000 atm
elementType: 8 8 8 7 7 7 6 6 6 6 6 6 6 6 6 6 6 6 1 1 1 1 1 1 1 1 1 1 1 1 1 1 1
symmnumber: 1
zpe: 689009.7 jmol-1
zpe.correction: 0.262430 hartree
zpe.thermalcorrener: 0.278085 hartree
zpe.thermalcorrenthalpy: 0.279029 hartree
zpe.thermalcorrgfe: 0.218694 hartree
zpe.sumelectzpe: -854.814394 hartree
zpe.sumelectthermal: -854.798739 hartree
zpe.sumelectthermalent: -854.797795 hartree
zpe.sumelectthermalfe: -854.858130 hartree
dipole: -6.6882 -2.6884 -3.8061
dipole: 8.1514
quadrupole: -147.7256 -104.1783 -100.0974
quadrupole: 9.1535 1.1354 -4.1275
quadrupole: -30.3918 13.1555 17.2364 9.1535 1.1354 -4.1275
hfenergy: -855.0768243 hartree
pointgroup: C01 [X(C12H15N3O3)]
dipole: -2.6767899 1.6488446 0.6332849 debye
polarizability: 263.8218395|1.8223721|152.5815757|-21.2785662|-8.0914909|114.0609939 unknown
InChI: InChI=1S/C12H15N3O3/c13-11(16)12(7-1-2-8-12)14-9-3-5-10(6-4-9)15(17)18/h3-6,14H,1-2,7-8,13H2
charge 0 multiplicity 1
33 atoms
O  -2.896594 -2.185156 1.667734
O  4.949389 1.094147 -0.975877
O  4.6844 -1.161317 -0.715061
N  -1.300902 0.878806 0.368943
N  -1.551431 -0.596023 2.698346
N  4.220944 0.049549 -0.72898
C  -2.392516 -0.128245 0.403323
C  -3.750205 0.642258 0.487197
C  -2.55031 -0.911461 -0.935996
C  -4.023244 1.110848 -0.964994
C  -3.418757 -0.0113 -1.870038
C  -2.284809 -1.077048 1.635915
C  0.043133 0.635464 0.080109
C  0.900052 1.747972 -0.199912
C  0.609022 -0.679289 0.090449
C  2.261714 1.562727 -0.462049
C  1.972911 -0.866049 -0.175203
C  2.795985 0.25058 -0.451685
H  -3.726296 1.461474 1.229891
H  -4.522304 -0.079434 0.806807
H  -3.06134 -1.860606 -0.700778
H  -1.574301 -1.158233 -1.385542
H  -3.531494 2.081966 -1.168826
H  -5.102292 1.260988 -1.141694
H  -4.215404 -0.610659 -2.344611
H  -2.814762 0.424383 -2.685091
H  -1.61001 1.847738 0.257334
H  -1.481952 -1.160965 3.544035
H  -1.042168 0.283623 2.623287
H  0.479645 2.761086 -0.212277
H  -0.012143 -1.548681 0.318733
H  2.923058 2.40538 -0.680058
H  2.417981 -1.86472 -0.170032
