program: Gaussian 09
title: 000238641
version: EM64L-G09RevD.01
frameworkgroup: C1[X(C12H14N2O4)]
method: RPBEPBE
basis: SDD
operation: Freq
keyword: #p
keyword: freq=noraman
keyword: PBEPBE/SDD
title: #p freq=noraman PBEPBE/SDD
converged: YES YES NO NO
title: Mulliken charges:
elementType: O O O O N N C C C C C C C C C C C C H H H H H H H H H H H H H H
charge: -0.407668 -0.214326 -0.233593 -0.231035 -0.441537 0.017082 0.301082 -0.545781 -0.499369 -0.426670 -0.440621 0.097749 0.482913 -0.420105 -0.299279 -0.348058 -0.413135 0.384374 0.237232 0.237150 0.258911 0.244378 0.237755 0.216533 0.228285 0.223314 0.301327 0.228591 0.266516 0.388895 0.284475 0.284615
chargesum: 0.00000
title: Mulliken charges with hydrogens summed into heavy atoms:
elementType: O O O O N N C C C C C C C C C C C C
charge: -0.018773 -0.214326 -0.233593 -0.231035 -0.140210 0.017082 0.301082 -0.071399 0.003921 0.027618 0.010977 0.097749 0.482913 -0.191514 -0.032763 -0.063583 -0.128520 0.384374
polarizability: 2.63085684e+02 5.83981418e+00 1.29544382e+02 4.25111185e+00 2.35912348e+01 1.27305926e+02
1716.lowfreq: -15.2935 -8.6460 -3.4284 0.0003 0.0007 0.0008 27.1989 31.9736 40.5706
frequency: 26.1474 31.8583 40.5206 54.8575 82.5379 89.6441 110.9254 160.0041 189.1604 232.4606 246.9371 283.8555 288.4501 340.4924 363.6686 400.9729 417.8335 441.8523 465.3115 506.9440 510.4284 539.1344 569.4408 596.7733 618.7081 629.8224 651.9003 665.2111 703.8447 728.0081 731.5028 771.7048 816.9664 821.1383 830.0509 839.1542 861.7586 896.8347 909.1757 944.2744 977.6676 980.5962 984.7206 991.2950 1032.8537 1043.6143 1053.3331 1073.1296 1099.2179 1110.9359 1127.8214 1171.2688 1182.6659 1207.8413 1229.6376 1234.8117 1247.0135 1283.6929 1292.5987 1304.5413 1307.5257 1315.2044 1320.0055 1326.7185 1347.0698 1383.5594 1447.5846 1463.4370 1466.2579 1468.3620 1481.5125 1490.7419 1511.7413 1585.1638 1622.8826 1647.3321 3001.3123 3003.4526 3006.5187 3029.8772 3063.9017 3067.6920 3080.1388 3098.6821 3127.9770 3163.2129 3181.3205 3184.1613 3515.7193 3545.1730
redmass: 3.7616 6.9638 6.8234 5.4075 5.9248 4.9923 5.8911 2.7478 5.4912 2.9398 5.6436 4.1797 3.1814 4.2450 3.1871 4.3928 2.6514 1.6168 3.5749 7.2998 3.4016 2.1640 2.0564 1.7642 4.4912 5.0942 4.9103 4.6777 3.3270 3.3280 4.2833 7.1856 1.5244 1.7232 2.8621 1.7350 2.0717 2.0149 2.7140 2.3229 1.3213 2.4643 1.3461 3.0839 1.6938 2.8275 2.0450 1.7622 3.0049 1.9592 1.5839 1.7120 1.4881 1.7031 1.3687 3.3300 1.5747 1.5907 1.3275 1.6174 1.2882 1.5727 1.5579 1.7817 6.0413 4.1061 3.5611 1.0886 1.2877 1.1117 1.1931 1.5201 2.5535 5.4801 6.5266 9.4397 1.0605 1.0628 1.0636 1.0616 1.1009 1.1009 1.1049 1.1049 1.0902 1.0882 1.0946 1.0962 1.0643 1.0766
irintensity: 0.1267 1.1795 0.7521 0.1216 0.9462 0.5243 0.6480 0.1418 1.1633 0.3574 1.8156 1.8038 0.6946 1.5261 19.0877 3.4252 16.1602 101.3815 2.2710 0.7998 12.5135 6.0841 21.8692 92.6831 21.3732 4.0965 50.6188 24.5929 5.9994 3.5150 9.7610 2.4724 2.6477 4.8636 2.1611 73.3523 6.6834 6.0135 11.4067 47.0515 4.8399 11.2656 2.0183 0.5495 54.6342 19.6164 97.6711 21.3948 12.3481 31.6583 12.8170 16.3952 296.0371 32.4603 2.8392 516.0103 21.7933 7.1415 0.4326 18.8192 10.4290 12.1183 7.0128 62.1111 85.1363 123.6440 3.4410 2.3662 33.8798 7.5694 9.3644 19.7696 117.4474 9.3780 421.6684 166.9909 26.1364 41.4894 19.2890 12.3927 15.3947 28.0191 41.5280 30.9439 11.2873 4.8091 0.3518 6.9749 35.0298 61.3259
temp: 298.150 k
press: 1.00000 atm
elementType: 8 8 8 8 7 7 6 6 6 6 6 6 6 6 6 6 6 6 1 1 1 1 1 1 1 1 1 1 1 1 1 1
symmnumber: 1
zpe: 653721.9 jmol-1
zpe.correction: 0.248990 hartree
zpe.thermalcorrener: 0.265434 hartree
zpe.thermalcorrenthalpy: 0.266378 hartree
zpe.thermalcorrgfe: 0.202841 hartree
zpe.sumelectzpe: -874.675740 hartree
zpe.sumelectthermal: -874.659296 hartree
zpe.sumelectthermalent: -874.658352 hartree
zpe.sumelectthermalfe: -874.721888 hartree
dipole: -8.9114 -2.0322 -2.5339
dipole: 9.4849
quadrupole: -138.4967 -102.5986 -100.9627
quadrupole: 3.6508 -0.8732 -2.8239
quadrupole: -24.4774 11.4208 13.0566 3.6508 -0.8732 -2.8239
hfenergy: -874.9247298 hartree
pointgroup: C01 [X(C12H14N2O4)]
dipole: -3.5190649 1.1066391 0.562885 debye
polarizability: 262.4417444|-2.3828017|151.3422326|-12.8193103|3.9781083|106.1520158 unknown
InChI: InChI=1S/C12H14N2O4/c15-11(16)12(7-1-2-8-12)13-9-3-5-10(6-4-9)14(17)18/h3-6,13,15H,1-2,7-8H2
charge 0 multiplicity 1
32 atoms
O  -1.698384 -0.314824 2.61158
O  -2.370926 -2.234619 1.497304
O  5.115364 0.964307 -0.577764
O  4.710323 -1.277211 -0.769909
N  -1.227356 0.934785 0.198965
N  4.313038 -0.055668 -0.588062
C  -2.316939 -0.05575 0.274659
C  -3.669333 0.717253 0.472155
C  -2.513102 -0.833757 -1.078129
C  -4.1475 1.008397 -0.967621
C  -3.855674 -0.32956 -1.691619
C  -2.125604 -1.009762 1.477455
C  0.119278 0.654175 0.009871
C  1.055236 1.738813 0.006321
C  0.612674 -0.67566 -0.18644
C  2.421044 1.51212 -0.186297
C  1.982185 -0.903125 -0.381086
C  2.883663 0.186629 -0.383944
H  -3.544415 1.607247 1.115321
H  -4.397437 0.051566 0.971561
H  -2.528826 -1.921937 -0.90103
H  -1.667048 -0.607519 -1.747572
H  -5.212388 1.296738 -1.004307
H  -3.556497 1.829804 -1.415289
H  -3.794277 -0.216649 -2.787511
H  -4.666815 -1.050412 -1.476942
H  -1.459833 1.880753 0.505039
H  0.691073 2.762178 0.156962
H  -0.068433 -1.530384 -0.177456
H  -1.605211 -0.947383 3.374741
H  3.142559 2.333226 -0.190316
H  2.37226 -1.913872 -0.528143
