program: Gaussian 09
title: 000238656
version: EM64L-G09RevD.01
frameworkgroup: C1[X(C19H21NO4S)]
method: RPBEPBE
basis: SDD
operation: Freq
keyword: #p
keyword: freq=noraman
keyword: PBEPBE/SDD
title: #p freq=noraman PBEPBE/SDD
converged: YES YES NO NO
title: Mulliken charges:
elementType: S O O O O N C C C C C C C C C C C C C C C C C C C H H H H H H H H H H H H H H H H H H H H H
charge: 0.172456 -0.287622 -0.443581 -0.211619 -0.305857 -0.416044 -0.357467 -0.145615 -0.708503 0.148816 -0.809586 0.498965 0.306786 -0.478881 -0.379221 -0.386126 0.458661 -0.220642 -0.221819 -0.381257 -0.382908 -0.240388 -0.229956 -0.211553 -0.242497 0.269497 0.253906 0.295097 0.259865 0.265468 0.370659 0.269918 0.268503 0.222840 0.243664 0.240489 0.233817 0.226618 0.226330 0.394440 0.234567 0.269837 0.228507 0.227575 0.240117 0.233743
chargesum: 0.00000
title: Mulliken charges with hydrogens summed into heavy atoms:
elementType: S O O O O N C C C C C C C C C C C C C C C C C C C
charge: 0.172456 -0.287622 -0.049141 -0.211619 -0.305857 -0.045385 0.165935 0.149482 -0.183170 0.148816 -0.271165 0.498965 0.306786 -0.012377 -0.138732 -0.152309 0.458661 0.005976 0.004511 -0.146689 -0.113071 -0.011881 -0.002380 0.028563 -0.008753
polarizability: 3.09500111e+02 -3.67936334e+00 2.01008016e+02 -4.18997912e+00 -2.68767555e+01 1.96177944e+02
1716.lowfreq: -9.6515 -2.0020 -0.0019 -0.0018 -0.0013 3.5531 7.9285 13.2407 18.6025
frequency: 5.4226 13.1125 18.5402 19.7184 23.8644 37.1053 45.0404 53.7426 64.9291 76.9075 90.8528 98.0457 107.8764 151.4197 179.5649 194.9404 215.0469 237.4974 254.8185 266.6539 290.4518 317.7997 326.6018 349.4789 393.0576 402.9222 404.6109 450.0414 471.2594 491.4259 528.5501 557.6532 566.3456 601.0920 612.4158 616.9115 617.0591 619.8043 647.8636 654.7886 683.7660 701.3015 702.6275 705.6174 740.4243 753.7031 765.0499 776.8624 807.2002 815.3268 822.2539 852.2124 860.3740 876.5899 886.2153 896.3224 924.7017 936.4890 961.8858 976.6121 982.4890 987.9218 989.5032 990.5234 994.4206 995.6329 1004.1374 1026.5974 1027.7103 1056.6213 1070.6303 1076.0380 1090.5808 1124.0903 1134.0500 1172.2135 1174.0450 1177.4268 1187.5086 1189.9709 1199.4304 1210.0877 1220.2400 1223.7375 1235.0596 1243.9349 1260.5489 1278.6236 1292.6304 1325.7591 1330.3333 1332.0265 1344.7543 1348.7548 1384.7496 1384.8932 1439.8569 1441.4692 1443.7903 1460.1908 1461.5316 1464.0721 1476.1541 1483.6855 1485.0502 1593.0677 1593.6908 1613.1696 1613.5539 1645.6035 1675.4244 2999.9017 3012.5544 3017.8993 3026.7238 3038.5793 3073.9955 3090.4351 3097.7391 3112.3125 3119.8129 3120.7429 3123.5795 3128.8886 3136.0578 3139.7604 3147.1360 3150.4128 3163.9626 3164.9866 3529.5522 3562.8536
redmass: 5.0608 5.0592 4.7765 5.1883 4.5346 5.6433 9.3847 4.5914 6.3066 6.3165 7.6928 6.1735 5.4413 5.7531 3.7601 2.9339 5.3206 4.5658 5.1424 5.9984 6.2082 3.7845 2.4707 2.8329 3.7330 2.8048 2.8328 4.0083 3.7297 4.1177 3.4536 5.5664 4.0471 3.1953 1.2245 6.2485 5.7495 1.7981 4.0516 5.1730 3.6735 1.6999 3.9252 2.3440 2.5973 1.6439 2.3631 2.1273 4.0884 3.4685 3.9931 1.2503 1.2470 5.0843 1.6252 2.7365 1.4596 1.4821 2.3055 1.3908 1.5406 2.7027 5.4321 3.9471 1.8398 1.6424 1.3328 2.1931 2.2277 3.4637 1.5252 1.7528 1.5226 1.8192 1.4230 1.0532 1.0550 1.4595 1.1154 1.1330 1.7180 1.3510 2.8626 2.3030 1.1593 1.3548 1.2624 1.2842 1.5061 1.2799 1.4710 1.3431 1.3373 1.3396 8.1782 8.3934 2.1793 2.1547 1.0908 1.1223 1.1490 1.0928 1.9466 2.3574 2.2436 6.0789 6.0720 6.1324 6.0252 9.4253 9.1688 1.0814 1.0585 1.0571 1.0606 1.0586 1.1041 1.1086 1.1056 1.1073 1.0868 1.0849 1.0879 1.0873 1.0921 1.0921 1.0964 1.0964 1.1017 1.1015 1.0645 1.0777
irintensity: 0.1911 0.2281 0.3614 0.0812 0.0420 2.0166 2.8043 0.6262 0.0542 0.3853 5.3295 2.9658 0.5319 1.2846 4.3719 0.1449 3.2595 0.8509 9.6526 2.2853 2.7455 1.0171 0.4802 4.6001 9.7364 0.0297 0.0922 6.2890 4.2881 13.9269 74.6167 6.4185 27.7198 5.8944 105.2440 0.0237 5.4687 91.9491 29.8648 1.8799 54.3668 71.5676 27.6392 70.8557 22.8214 28.8920 27.8809 34.5015 5.3315 10.7154 1.2633 0.1885 0.9705 37.7087 5.1678 13.3856 3.7935 4.7309 49.9866 0.0383 22.3646 104.6425 4.6426 21.1992 74.6586 42.5053 0.0665 9.9720 1.8370 31.4754 34.9302 133.4625 8.4844 40.2178 8.0652 0.0648 0.1606 1.1414 0.3480 12.9438 134.7054 19.8608 21.2275 0.3503 8.3155 8.6115 8.0351 4.3818 39.6711 1.2227 17.6488 15.8244 7.0215 7.5088 0.6209 0.0977 10.7925 5.4271 7.1620 5.9272 8.0638 26.2798 450.4542 14.1346 26.1317 1.2770 1.5746 3.0233 0.1959 178.4172 230.5597 13.0933 16.3339 25.5260 12.5357 38.2264 1.0840 6.3748 16.2807 5.6161 4.5916 6.5642 0.4184 1.5927 17.6102 14.3291 36.1206 29.6897 24.3934 15.7785 38.6071 93.0995
temp: 298.150 k
press: 1.00000 atm
elementType: 16 8 8 8 8 7 6 6 6 6 6 6 6 6 6 6 6 6 6 6 6 6 6 6 6 1 1 1 1 1 1 1 1 1 1 1 1 1 1 1 1 1 1 1 1 1
symmnumber: 1
zpe: 953642.9 jmol-1
zpe.correction: 0.363223 hartree
zpe.thermalcorrener: 0.387920 hartree
zpe.thermalcorrenthalpy: 0.388864 hartree
zpe.thermalcorrgfe: 0.300979 hartree
zpe.sumelectzpe: -1488.520076 hartree
zpe.sumelectthermal: -1488.495380 hartree
zpe.sumelectthermalent: -1488.494436 hartree
zpe.sumelectthermalfe: -1488.582321 hartree
dipole: 0.4889 2.6914 -2.2243
dipole: 3.5256
quadrupole: -134.5400 -163.6001 -148.4724
quadrupole: 2.9031 -9.5667 -4.8921
quadrupole: 14.3308 -14.7293 0.3985 2.9031 -9.5667 -4.8921
hfenergy: -1488.8832996 hartree
pointgroup: C01 [X(C19H21N1O4S1)]
dipole: -1.1141677 0.2156921 0.7975634 debye
polarizability: 225.9201578|43.544418|284.799664|-17.3161519|24.9175259|195.9662486 unknown
InChI: InChI=1S/C19H21NO4S/c21-18(22)17(11-12-25-14-16-9-5-2-6-10-16)20-19(23)24-13-15-7-3-1-4-8-15/h1-10,17,20-21H,11-14H2
charge 0 multiplicity 1
46 atoms
S  2.597715 -1.170398 0.931361
O  -3.148329 -1.06896 -0.59057
O  -1.325101 -5.050601 0.550908
O  0.449882 -5.75129 -0.776784
O  -1.417295 -1.025608 -2.204202
N  -1.594559 -2.724445 -0.597461
C  0.929387 -2.712157 -0.800694
C  -0.41867 -3.466847 -1.066246
C  1.180257 -2.403199 0.684487
C  -0.364249 -4.863026 -0.457297
C  1.634181 0.437278 0.512153
C  2.576261 1.616326 0.506938
C  -1.991803 -1.564879 -1.217697
C  -3.607025 0.282752 -1.067871
C  3.31127 1.950804 -0.660554
C  2.748365 2.408504 1.67154
C  -2.906466 1.398337 -0.322235
C  4.193306 3.05404 -0.665723
C  3.630888 3.512125 1.669928
C  -3.425171 1.879452 0.907208
C  -1.714113 1.968813 -0.839326
C  4.355839 3.838861 0.50028
C  -2.761118 2.907127 1.613549
C  -1.046924 2.994317 -0.132914
C  -1.568552 3.464932 1.095137
H  0.879014 -1.77803 -1.386426
H  1.754054 -3.320907 -1.211538
H  -0.485338 -3.601697 -2.164259
H  0.283166 -1.974306 1.164934
H  1.482366 -3.301513 1.250649
H  -2.142965 -3.095989 0.180112
H  0.844222 0.54883 1.273274
H  1.166504 0.288313 -0.475291
H  -4.687725 0.257941 -0.857915
H  -3.42393 0.338375 -2.154484
H  3.192826 1.338928 -1.562928
H  2.18889 2.155634 2.580348
H  4.753041 3.301096 -1.574901
H  3.753236 4.11462 2.57714
H  -1.243372 -5.967176 0.928479
H  -4.34812 1.445262 1.311356
H  -1.310657 1.592456 -1.786172
H  5.040356 4.69461 0.497053
H  -3.171606 3.273666 2.561157
H  -0.122106 3.423453 -0.534287
H  -1.05013 4.261078 1.641286
