program: Gaussian 09
title: 000238621
version: EM64L-G09RevD.01
frameworkgroup: C1[X(C16H10Br2S2)]
method: RPBEPBE
basis: SDD
operation: Freq
keyword: #p
keyword: freq=noraman
keyword: PBEPBE/SDD
title: #p freq=noraman PBEPBE/SDD
converged: YES YES NO NO
title: Mulliken charges:
elementType: Br Br S S C C C C C C C C C C C C C C C C H H H H H H H H H H
charge: 0.077960 0.077952 0.328116 0.328128 0.399330 0.399304 0.003356 0.003325 -0.634934 -0.634922 -0.372280 -0.372269 -0.341724 -0.341718 -0.218570 -0.218553 -0.226486 -0.226482 -0.232364 -0.232369 0.264607 0.264597 0.255475 0.255472 0.232101 0.232100 0.231967 0.231968 0.233454 0.233457
chargesum: 0.00000
title: Mulliken charges with hydrogens summed into heavy atoms:
elementType: Br Br S S C C C C C C C C C C C C C C C C
charge: 0.077960 0.077952 0.328116 0.328128 0.399330 0.399304 0.003356 0.003325 -0.634934 -0.634922 -0.107673 -0.107671 -0.086248 -0.086246 0.013531 0.013547 0.005481 0.005486 0.001090 0.001088
polarizability: 3.75280191e+02 -9.35776368e+00 2.57581960e+02 2.75342664e-03 3.24015253e-03 1.38338372e+02
1716.lowfreq: -6.9609 -2.1176 -0.0020 -0.0003 0.0004 2.2092 23.2615 32.0782 38.8817
frequency: 23.1869 32.0510 38.8164 48.5564 52.6057 73.8123 74.7487 147.3836 166.1475 172.8652 180.6811 196.1488 214.8415 230.3803 303.0559 305.8452 334.8837 343.3596 348.3098 403.0887 403.5261 419.1616 477.9433 486.8676 576.2174 579.6976 586.3808 607.3367 616.3820 625.1967 679.2285 681.6840 699.8987 701.0140 753.3618 761.8910 788.7954 788.8695 852.7817 853.0211 868.6670 895.2783 933.5474 935.1830 981.1508 981.2282 987.8785 987.9879 999.7220 999.7379 1028.0315 1028.2606 1084.9795 1085.5987 1174.9618 1174.9752 1191.6066 1192.3048 1206.5129 1214.4900 1316.8652 1316.9403 1375.1437 1375.4801 1431.3178 1431.3404 1471.8482 1473.5805 1566.9151 1576.3176 1582.1600 1587.3878 1605.5853 1605.6284 3130.5134 3130.5359 3139.6465 3139.6664 3151.5082 3151.5674 3162.1350 3162.1528 3172.4627 3172.5605
redmass: 7.0350 6.0014 7.1260 4.6636 8.8186 7.3599 7.1576 7.2815 12.2361 8.9373 6.0140 9.5202 12.6112 7.7544 12.0689 9.9553 14.0295 8.0387 9.4124 2.9150 2.8454 12.1172 4.7559 4.0772 8.1333 5.9048 8.6363 7.3383 6.4084 6.9531 8.2878 9.7635 1.8165 1.7908 2.8483 2.8083 3.7305 3.1989 1.2500 1.2447 6.2327 5.1577 1.4524 1.5529 1.3863 1.3894 6.0710 6.0921 1.3212 1.3210 2.1799 2.1725 1.6090 1.6097 1.0532 1.0532 1.1445 1.1226 3.7921 4.0548 1.3571 1.3574 6.6244 6.7228 2.2863 2.2888 2.2004 2.2058 9.5250 6.7797 6.2645 8.7797 6.0598 6.0721 1.0850 1.0850 1.0883 1.0883 1.0932 1.0932 1.0965 1.0965 1.1009 1.1010
irintensity: 0.4141 0.0031 0.3057 0.0791 0.0779 0.7555 0.1363 0.3481 1.6793 0.3954 1.3658 0.0428 0.0173 1.9703 0.0127 3.1475 6.3770 4.0641 0.5381 0.5339 0.2883 12.6766 2.0631 10.7516 2.1292 6.3599 0.4900 21.3672 2.6093 16.5933 9.0019 103.4879 46.3731 78.6997 39.2508 12.8897 50.6651 36.0726 0.1356 0.0011 2.2217 22.0908 3.9750 4.4793 0.0201 1.1661 2.4473 0.0506 0.0675 0.1001 15.0168 1.1301 5.0356 10.3783 0.0035 0.0881 14.5948 0.0006 13.8424 0.6900 2.2529 0.1575 0.3155 0.2014 20.0866 3.5999 19.7127 3.1663 2.5649 3.3902 2.2438 0.7185 0.3096 0.2204 1.4309 0.0220 2.1933 6.2847 42.5417 0.2335 17.6088 26.1517 36.4594 0.6815
temp: 298.150 k
press: 1.00000 atm
elementType: 35 35 16 16 6 6 6 6 6 6 6 6 6 6 6 6 6 6 6 6 1 1 1 1 1 1 1 1 1 1
symmnumber: 1
zpe: 537191.4 jmol-1
zpe.correction: 0.204605 hartree
zpe.thermalcorrener: 0.223350 hartree
zpe.thermalcorrenthalpy: 0.224294 hartree
zpe.thermalcorrgfe: 0.153752 hartree
zpe.sumelectzpe: -1437.318776 hartree
zpe.sumelectthermal: -1437.300031 hartree
zpe.sumelectthermalent: -1437.299087 hartree
zpe.sumelectthermalfe: -1437.369629 hartree
dipole: 0.0002 -0.0001 -1.2603
dipole: 1.2603
quadrupole: -119.1292 -145.3041 -151.5494
quadrupole: -3.5141 0.0007 0.0005
quadrupole: 19.5317 -6.6432 -12.8885 -3.5141 0.0007 0.0005
hfenergy: -1437.523381 hartree
pointgroup: C01 [X(C16H10Br2S2)]
dipole: -0.0000752 0.0001028 0.4958381 debye
polarizability: 375.2494512|-9.549073|257.6126881|-0.0042145|-0.0369719|138.3383835 unknown
InChI: InChI=1S/C16H10Br2S2/c17-15-13(11-7-3-1-4-8-11)19-16(18)14(20-15)12-9-5-2-6-10-12/h1-10H
charge 0 multiplicity 1
30 atoms
Br 1.415985 -2.943897 0.229047
Br -1.415626 2.943931 0.227542
S  -0.815774 -1.375262 -1.384269
S  0.81586 1.374327 -1.385203
C  2.975941 0.075455 -0.100899
C  -2.975767 -0.075603 -0.100602
C  -1.609359 0.13821 -0.634233
C  1.609474 -0.138665 -0.634327
C  0.860599 -1.279325 -0.652511
C  -0.860468 1.278834 -0.653197
C  4.031327 -0.816449 -0.441441
C  -4.031249 0.815962 -0.441737
C  3.262198 1.196127 0.726944
C  -3.261925 -1.19572 0.728031
C  5.33495 -0.600091 0.052326
C  -5.334828 0.599861 0.052254
C  4.565358 1.403862 1.223858
C  -4.565047 -1.403217 1.225138
C  5.606782 0.506487 0.890013
C  -5.606553 -0.506147 0.890732
H  3.830903 -1.664897 -1.102511
H  -3.830958 1.663944 -1.103448
H  2.459064 1.897058 0.978248
H  -2.458729 -1.896415 0.979803
H  6.139419 -1.290695 -0.223177
H  -6.139349 1.290228 -0.223696
H  4.768656 2.265975 1.868167
H  -4.76824 -2.264918 1.87003
H  6.62033 0.672472 1.271268
H  -6.620072 -0.671932 1.272149
