program: Gaussian 09
title: 000238582
version: EM64L-G09RevD.01
frameworkgroup: C1[X(C8H9NO2S)]
method: RPBEPBE
basis: SDD
operation: Freq
keyword: #p
keyword: freq=noraman
keyword: PBEPBE/SDD
title: #p freq=noraman PBEPBE/SDD
converged: YES YES NO NO
title: Mulliken charges:
elementType: S O O N C C C C C C C C H H H H H H H H H
charge: 0.025617 -0.442087 -0.234819 -0.449878 0.532452 -0.578597 -0.379536 0.347452 -0.169831 -0.421805 0.284627 -0.854963 0.244384 0.310085 0.309350 0.228070 0.223491 0.261156 0.314255 0.357140 0.093436
chargesum: 0.00000
title: Mulliken charges with hydrogens summed into heavy atoms:
elementType: S O O N C C C C C C C C
charge: 0.119054 -0.084947 -0.234819 -0.140528 0.532452 -0.334212 -0.069451 0.347452 0.058239 -0.198313 0.284627 -0.279553
polarizability: 1.79918977e+02 -5.06421704e+00 1.14002902e+02 -5.53681608e+00 -3.53772826e+00 6.73017350e+01
1716.lowfreq: -2.4738 -0.0022 0.0007 0.0015 4.5712 11.1113 32.0230 48.8163 77.0163
frequency: 32.0026 48.8049 77.0130 150.0943 165.9981 201.9991 226.9463 269.2274 281.9547 335.6272 355.1391 424.6491 454.6559 503.0528 523.1919 579.4305 594.9910 645.2004 673.4967 688.5853 725.1191 776.2058 778.6744 787.6208 864.0274 888.3163 888.7156 954.3790 979.0359 982.7017 993.5585 1089.4560 1125.4478 1141.4043 1173.5235 1200.6212 1238.5922 1255.5690 1280.6975 1312.8132 1388.2467 1433.6895 1445.6040 1481.9316 1522.8830 1602.4852 1626.4233 1636.1499 2423.4363 3030.7920 3123.5299 3134.1145 3140.7897 3153.5703 3204.6115 3521.9953 3588.2839
redmass: 6.1757 7.2108 6.0677 3.1204 2.9556 1.5429 4.6992 5.1116 7.2699 3.3113 1.1039 4.0560 2.9734 4.3746 5.5779 5.4308 2.5801 1.6085 6.2049 2.0382 2.6288 3.3864 1.7107 1.6931 1.7062 2.6050 1.7686 2.4402 4.0095 1.3093 2.6078 1.6082 1.3420 1.3743 1.1010 1.4862 1.8793 1.1783 2.4150 1.7204 6.1717 1.3971 1.7067 2.8273 2.2847 5.8685 5.4343 6.3133 1.0385 1.0638 1.0887 1.1016 1.0921 1.0949 1.0952 1.0764 1.0661
irintensity: 0.8901 2.6708 1.0624 16.0522 7.9703 22.2813 0.9677 3.3025 0.8834 2.5892 145.5803 10.7730 5.5799 10.1518 7.6935 13.4985 4.1831 64.3232 9.3925 27.0891 1.5874 11.2845 37.6213 7.9786 44.8955 21.5707 19.2411 7.2635 6.1225 4.8302 19.4577 20.2270 60.8166 246.8833 2.4079 6.6985 29.7042 2.1613 62.1371 54.0492 124.7524 58.5602 21.9991 151.7305 144.0722 138.4289 188.5118 75.0905 32.9678 21.9408 11.8047 1.6716 7.6248 14.5975 8.1690 11.5441 41.8832
temp: 298.150 k
press: 1.00000 atm
elementType: 16 8 8 7 6 6 6 6 6 6 6 6 1 1 1 1 1 1 1 1 1
symmnumber: 1
zpe: 407490.4 jmol-1
zpe.correction: 0.155205 hartree
zpe.thermalcorrener: 0.167074 hartree
zpe.thermalcorrenthalpy: 0.168018 hartree
zpe.thermalcorrgfe: 0.115904 hartree
zpe.sumelectzpe: -912.628711 hartree
zpe.sumelectthermal: -912.616842 hartree
zpe.sumelectthermalent: -912.615898 hartree
zpe.sumelectthermalfe: -912.668012 hartree
dipole: 2.8708 -2.6554 0.8292
dipole: 3.9976
quadrupole: -69.1631 -80.4908 -79.0493
quadrupole: 8.7589 -8.2675 -1.2813
quadrupole: 7.0713 -4.2564 -2.8149 8.7589 -8.2675 -1.2813
hfenergy: -912.7839161 hartree
pointgroup: C01 [X(C8H9N1O2S1)]
dipole: 1.1879605 -0.9808164 0.316782 debye
dipolederiv: -0.0361915 -0.1847955 0.0634464 -0.3052291 -0.1490294 0.0037445 -0.0585625 0.0259077 -0.1292966 -0.9205265 0.6148185 -0.0721737 0.7760012 -0.6772416 -0.0246221 -0.0802152 -0.023044 -0.4175457 -0.7109454 -0.0338065 -0.0049281 0.4852539 -0.8727711 -0.0649462 -0.0356253 0.0596462 -0.3046013 -1.7724907 0.0760276 0.0108934 0.1959779 -0.3519962 -0.024756 0.1066291 0.0003567 -0.2934026 1.1474923 0.0539286 -0.0733705 0.4322838 0.2851495 -0.050175 -0.1629982 -0.0363339 0.1394246 -0.5547497 0.1842083 -0.0178758 0.0371693 -0.0511303 -0.0418796 0.0285543 -0.0505488 -0.2283636 -0.3778391 -0.0754285 0.0142477 -0.2255522 -0.2309219 0.0195429 0.0504346 0.0153857 -0.2065805 1.011929 -0.5439322 0.0140032 -0.7408498 0.6690825 -0.0347206 0.0277993 -0.0385736 0.1043413 0.2954468 0.0397512 -0.0429645 -0.0326883 0.1759097 -0.0416532 -0.0412679 -0.0528841 -0.1001921 -0.2161111 0.0036345 -0.0173663 0.3294725 -0.3249432 -0.0145398 -0.0592565 0.0149409 -0.2353976 1.7538715 -0.0591733 0.054158 -0.7579028 1.0762381 0.0685249 0.0416083 -0.0848906 0.0404738 -0.1260845 -0.1037512 -0.0130249 -0.0303735 0.000483 0.0607318 0.1048734 -0.01204 0.2586445 0.0768692 -0.066661 0.0246119 -0.0561971 -0.044783 0.0443226 0.0208784 0.0442675 0.1730319 0.1408611 0.0660562 0.0023598 0.0388711 0.0913453 0.0188232 0.0011883 0.0086711 0.1887547 0.1732033 0.0217585 0.0261986 -0.0372269 0.0875754 0.0232403 0.027292 0.0172912 0.2765244 0.0658163 -0.039263 0.0144456 -0.0560982 -0.0889692 0.044214 0.0191975 0.0441763 0.1413916 -0.1357121 -0.0285312 0.0362824 -0.0064632 0.0825022 0.0185241 0.0360955 0.0200454 0.1772408 0.0073446 0.0406647 -0.1132387 -0.0390964 -0.0425093 0.0846456 -0.0624533 0.0653004 -0.0647648 0.0222983 0.0132908 0.0198624 0.0519881 0.0700324 -0.0606544 0.0266465 -0.0330785 0.0689196 0.2553202 -0.1364832 0.0405434 -0.208633 0.2308576 0.0460547 0.0499576 0.0404617 0.37374 -0.099802 0.1576867 0.0338895 0.1492926 0.0651196 -0.0744219 -0.0407758 -0.0250573 0.0376576 unknown
polarizability: 180.5487428|0.0177082|113.92751|-0.3436513|-0.9712306|66.7473606 unknown
InChI: InChI=1S/C8H9NO2S/c10-7-3-1-2-6(4-7)9-8(11)5-12/h1-4,9-10,12H,5H2
charge 0 multiplicity 1
21 atoms
S  -4.275497 -1.119466 -1.081466
O  3.60583 -1.622531 0.065683
O  -2.305055 1.526019 0.227917
N  -1.055353 -0.466135 0.36063
C  0.277493 -0.007365 0.146193
C  1.305765 -0.982304 0.202779
C  0.592083 1.353782 -0.117794
C  2.644706 -0.598083 -0.005796
C  1.941763 1.708199 -0.322614
C  2.97935 0.751842 -0.271401
C  -2.242263 0.272676 0.375254
C  -3.490297 -0.590514 0.570582
H  1.089419 -2.037463 0.405727
H  -0.205761 2.095865 -0.154492
H  -1.144804 -1.470866 0.531647
H  2.189675 2.755403 -0.526835
H  4.022811 1.049454 -0.433831
H  -3.30772 -1.49063 1.182122
H  -4.268491 0.022192 1.047737
H  4.513147 -1.262792 -0.094055
H  -3.2084 -1.894785 -1.511687
