program: Gaussian 09
title: 000238553
version: EM64L-G09RevD.01
frameworkgroup: C1[X(C10H16N2)]
method: RPBEPBE
basis: SDD
operation: Freq
keyword: #pfreq=noraman
keyword: PBEPBE/SDD
title: #p freq=noraman PBEPBE/SDD
converged: YES YES NO NO
title: Mulliken charges:
elementType: N N C C C C C C C C C C H H H H H H H H H H H H H H H H
charge: -0.250630 -0.285276 0.195628 0.382341 0.342143 -0.436835 -0.421954 -0.817908 -0.812722 -0.245140 -0.641356 -0.607327 0.226521 0.224919 0.214311 0.211677 0.253232 0.224895 0.231310 0.225244 0.220362 0.211689 0.235660 0.210495 0.255228 0.196262 0.240122 0.217108
chargesum: 0.00000
title: Mulliken charges with hydrogens summed into heavy atoms:
elementType: N N C C C C C C C C C C
charge: -0.250630 -0.030048 0.195628 0.382341 0.342143 -0.210314 -0.197035 -0.138688 -0.131273 -0.024778 0.016488 0.046166
polarizability: 1.55440482e+02 -1.12607100e+00 1.33965572e+02 -6.47020779e+00 1.05941791e+00 8.16763531e+01
1716.lowfreq: -11.5794 -0.0006 0.0006 0.0007 5.0442 11.9486 47.1743 86.6461 93.2234
frequency: 47.1024 86.5796 93.2109 128.8849 158.4567 166.8903 200.4659 211.8140 226.3924 245.2793 262.0403 292.4593 342.5847 362.4029 391.2911 482.5423 509.9510 513.0059 542.3547 561.4034 612.5650 645.7856 755.4476 769.4408 771.7688 895.2840 915.2179 924.9379 962.5717 981.8655 1021.9750 1034.3059 1045.0909 1049.5089 1085.5045 1100.3436 1108.8262 1118.9561 1144.7414 1173.6789 1194.4054 1257.1689 1261.0484 1323.6596 1363.4138 1388.7622 1392.6620 1414.1383 1425.2392 1432.2532 1448.8525 1449.5734 1453.4060 1460.5736 1468.8212 1474.3810 1483.9853 1487.9906 1491.3787 1513.4152 1588.1040 1601.4118 2906.4608 2919.7214 2970.3707 2972.2638 2975.7183 3030.9392 3047.4727 3052.4894 3081.3205 3081.8277 3085.1715 3085.4615 3112.5296 3120.8236 3151.4633 3390.2020
redmass: 3.0951 3.1780 2.8890 1.7100 1.1009 1.2579 1.5584 1.3668 2.0154 1.4925 3.4104 2.7336 2.6271 3.4500 2.6747 3.3036 3.6340 3.3429 5.2301 3.0659 3.7175 1.7479 4.3737 3.1530 1.3456 1.3083 2.4564 2.0603 1.3328 1.6037 2.2113 1.9251 1.6143 1.9533 1.7820 1.3359 1.2941 1.7204 2.3569 1.1731 3.6400 2.2170 2.4156 2.8078 6.6568 1.2683 1.2641 1.2148 1.2652 1.4861 1.1156 1.3368 1.3110 1.1449 1.0681 1.0661 1.1423 1.2680 1.1246 1.2589 7.3838 5.5273 1.0482 1.0403 1.0465 1.0367 1.0902 1.0808 1.0947 1.0959 1.0997 1.0992 1.0993 1.0953 1.0854 1.0916 1.0991 1.0750
irintensity: 4.3518 0.5744 3.1857 0.2416 1.4749 2.3575 2.6781 0.5908 0.3561 1.5278 4.2361 1.0785 7.8461 6.6258 4.0922 1.2908 7.3862 0.7723 0.9934 6.4215 31.1898 71.8400 4.6711 10.7126 52.5504 0.6331 2.1848 1.7760 0.2565 4.9698 1.7978 11.8500 1.1746 6.7810 60.7099 3.0152 0.5939 3.5214 11.4342 0.9923 14.9202 0.5934 2.7456 15.9181 0.7719 17.1655 9.8049 10.2342 9.6585 11.8276 6.3373 14.4063 9.8766 3.9405 18.3335 22.3068 15.3245 33.6945 13.3766 25.2382 2.7186 10.3509 42.1306 178.1713 31.9174 22.0262 93.7849 36.6533 24.0563 20.9243 17.8214 40.1817 7.7763 32.8539 1.2422 34.4954 37.5775 10.4649
temp: 298.150 k
press: 1.00000 atm
elementType: 7 7 6 6 6 6 6 6 6 6 6 6 1 1 1 1 1 1 1 1 1 1 1 1 1 1 1 1
symmnumber: 1
zpe: 629844.7 jmol-1
zpe.correction: 0.239895 hartree
zpe.thermalcorrener: 0.253317 hartree
zpe.thermalcorrenthalpy: 0.254261 hartree
zpe.thermalcorrgfe: 0.200752 hartree
zpe.sumelectzpe: -499.190488 hartree
zpe.sumelectthermal: -499.177067 hartree
zpe.sumelectthermalent: -499.176122 hartree
zpe.sumelectthermalfe: -499.229631 hartree
dipole: -2.3997 -0.4467 0.6613
dipole: 2.5289
quadrupole: -65.8892 -69.2898 -75.2531
quadrupole: -0.9351 -1.4419 0.7787
quadrupole: 4.2548 0.8542 -5.1090 -0.9351 -1.4419 0.7787
hfenergy: -499.4303835 hartree
pointgroup: C01 [X(C10H16N2)]
dipole: 0.941388 0.2816132 0.1561518 debye
polarizability: 156.0251112|0.9813908|133.6005081|-0.232264|-4.3519594|81.4567883 unknown
InChI: InChI=1S/C10H16N2/c1-8-6-5-7-9(2)10(8)12(4)11-3/h5-7,11H,1-4H3
charge 0 multiplicity 1
28 atoms
N  1.338444 0.073117 0.315551
N  2.141539 -0.673377 -0.587963
C  -0.085018 -0.016632 0.177285
C  -0.72273 -1.296742 0.269865
C  -0.867987 1.163041 -0.039566
C  -2.129549 -1.372525 0.144083
C  -2.277588 1.044647 -0.128871
C  0.083801 -2.55333 0.527988
C  -0.223446 2.526523 -0.232528
C  -2.912311 -0.211709 -0.043584
C  1.998275 0.97779 1.266083
C  2.780795 0.112109 -1.669628
H  -2.615986 -2.352888 0.2195
H  -2.876065 1.94887 -0.295895
H  0.802854 -2.394879 1.354746
H  -0.57473 -3.398748 0.793026
H  0.680196 -2.82865 -0.36074
H  0.092042 2.990904 0.721996
H  0.678444 2.452086 -0.867254
H  -0.930439 3.222427 -0.716314
H  -4.002277 -0.287153 -0.126453
H  2.790676 0.430527 1.820647
H  1.260839 1.330313 2.006156
H  2.46844 1.869538 0.797169
H  2.803772 -1.284548 -0.086923
H  3.456942 0.924891 -1.316822
H  1.99573 0.560379 -2.302501
H  3.370836 -0.580183 -2.297855
