program: Gaussian 09
title: 000238560
version: EM64L-G09RevD.01
frameworkgroup: C1[X(C17H18O)]
method: RPBEPBE
basis: SDD
operation: Freq
keyword: #pfreq=noraman
keyword: PBEPBE/SDD
title: #p freq=noraman PBEPBE/SDD
converged: YES YES NO NO
title: Mulliken charges:
elementType: O C C C C C C C C C C C C C C C C C H H H H H H H H H H H H H H H H H H
charge: -0.179164 0.055879 0.448904 0.160871 -0.703981 -0.761413 -0.676123 -0.385846 -0.417853 0.486212 -0.247924 -0.240640 -0.373704 -0.406463 -0.245919 -0.232182 -0.237520 -0.244332 0.236114 0.213628 0.229693 0.236326 0.231167 0.226910 0.243321 0.242337 0.250885 0.245708 0.230803 0.225319 0.247704 0.236363 0.230553 0.223798 0.224495 0.226073
chargesum: 0.00000
title: Mulliken charges with hydrogens summed into heavy atoms:
elementType: O C C C C C C C C C C C C C C C C C
charge: -0.179164 0.055879 0.448904 0.160871 -0.024545 -0.067009 -0.190465 -0.134961 -0.172145 0.486212 -0.017121 -0.015322 -0.126000 -0.170099 -0.015366 -0.008384 -0.013026 -0.018259
polarizability: 1.95616216e+02 3.75551156e+00 2.00482848e+02 -3.00675906e+01 1.06549384e+00 1.28346727e+02
1716.lowfreq: -13.3251 -6.5437 0.0004 0.0006 0.0007 5.7312 11.8494 25.6563 32.7492
frequency: 5.2668 24.2600 32.6023 51.6139 84.1402 92.1179 170.8950 189.5016 197.0857 222.6426 250.6018 290.1305 300.5306 319.0402 324.4604 371.3767 394.8551 402.8245 403.1631 449.9057 470.2219 533.2099 562.9713 571.2033 615.9118 616.8832 650.3002 699.0026 707.0242 724.2100 756.4257 771.5729 795.7823 830.7509 847.6043 857.0745 895.7854 914.2457 922.0734 942.8778 943.4959 971.8020 980.7909 988.4854 989.7190 992.2928 995.0092 998.2527 1026.1227 1027.0492 1039.9614 1080.9529 1081.7741 1104.3642 1152.9097 1167.7404 1171.8147 1174.6384 1189.1259 1198.5867 1207.8700 1212.0168 1242.3413 1286.3304 1324.0395 1332.3969 1375.1297 1380.4176 1383.2814 1397.7017 1433.4206 1438.3312 1447.0433 1458.7311 1463.0107 1482.6491 1483.2391 1486.4169 1487.9060 1587.5382 1593.8228 1606.7885 1611.1861 1623.8618 2976.9705 2983.3186 2994.0599 3067.5017 3078.0522 3085.1596 3093.9272 3102.1102 3118.1605 3118.7367 3125.6821 3126.4807 3139.1028 3139.2656 3149.9786 3151.3950 3164.2459 3164.5849
redmass: 4.8049 4.0283 4.4051 4.1532 4.3173 5.7065 3.4026 2.9662 1.1594 3.4994 2.9728 1.0957 3.4064 2.6185 2.5228 5.2932 3.2508 2.8023 2.8236 3.5667 3.2542 3.8001 3.3467 3.7769 6.3639 6.2135 4.2951 2.1058 1.7034 2.0930 2.6579 2.0143 2.9254 3.4440 1.2508 1.2478 2.5002 1.5503 1.4551 1.4409 2.0334 1.3924 1.3861 3.4139 4.5570 1.4358 1.7630 1.3234 2.4482 2.2430 2.3326 1.6365 1.6847 1.8994 1.4724 2.0427 1.0607 1.1064 1.1342 1.1275 2.1021 3.1757 3.3419 1.6148 1.3609 1.2781 3.9950 1.4080 6.2740 1.1931 2.1706 1.6730 1.3071 1.0667 1.0646 1.7813 1.5765 1.3828 1.1211 5.9412 6.0826 6.5943 6.0314 8.3241 1.0638 1.0356 1.0352 1.0952 1.0996 1.1003 1.1006 1.0995 1.0854 1.0864 1.0866 1.0876 1.0925 1.0922 1.0951 1.0960 1.1013 1.1010
irintensity: 0.1917 0.0924 0.6059 0.9547 0.6098 1.9625 0.3465 1.4600 0.5458 1.1327 0.4650 0.0611 1.1602 3.3184 1.7094 2.4402 0.8801 0.0134 0.0147 1.1484 5.2853 9.5049 24.5616 12.4130 0.1924 0.2051 0.4815 35.2332 64.6940 36.7256 5.3973 43.8438 9.2268 3.8246 0.3616 0.2607 0.8297 0.9096 1.1313 3.8483 0.9681 0.3989 0.2739 8.7451 0.7675 2.0817 12.8847 2.4124 14.8439 4.5137 85.8871 26.7975 5.2515 6.5613 0.8369 2.1981 0.1569 0.5593 0.6039 0.2644 5.3575 0.2742 8.8931 67.4620 0.9295 5.8431 5.6933 14.8193 3.3055 18.3912 11.0203 6.6472 9.8686 4.3429 3.5155 40.1262 1.7550 9.0945 25.5974 7.0609 1.9401 45.9030 5.7223 67.6514 9.6538 25.4351 24.5452 10.3897 17.7593 26.8590 28.6813 26.7981 5.3371 4.4437 0.1140 1.9735 45.8090 2.8948 30.2216 33.5992 22.4035 12.6381
temp: 298.150 k
press: 1.00000 atm
elementType: 8 6 6 6 6 6 6 6 6 6 6 6 6 6 6 6 6 6 1 1 1 1 1 1 1 1 1 1 1 1 1 1 1 1 1 1
symmnumber: 1
zpe: 781527.7 jmol-1
zpe.correction: 0.297668 hartree
zpe.thermalcorrener: 0.314481 hartree
zpe.thermalcorrenthalpy: 0.315425 hartree
zpe.thermalcorrgfe: 0.249978 hartree
zpe.sumelectzpe: -732.537259 hartree
zpe.sumelectthermal: -732.520446 hartree
zpe.sumelectthermalent: -732.519502 hartree
zpe.sumelectthermalfe: -732.584949 hartree
dipole: 1.7162 1.2114 -1.7813
dipole: 2.7543
quadrupole: -101.7750 -101.0195 -107.9387
quadrupole: -1.9055 -5.4508 6.0100
quadrupole: 1.8027 2.5582 -4.3609 -1.9055 -5.4508 6.0100
hfenergy: -732.8349271 hartree
pointgroup: C01 [X(C17H18O1)]
dipole: -0.7121546 -0.4092707 -0.706784 debye
polarizability: 195.6162978|4.5556928|199.5410204|30.6833845|-4.9114169|129.2884727 unknown
InChI: InChI=1S/C17H18O/c1-17(2,15-11-7-4-8-12-15)16(18)13-14-9-5-3-6-10-14/h3-12H,13H2,1-2H3
charge 0 multiplicity 1
36 atoms
O  0.714502 2.338727 0.917987
C  -1.486533 1.67057 0.038914
C  -1.961672 0.201209 0.053432
C  0.072512 1.692306 0.052102
C  -2.031053 2.409324 1.290859
C  -1.932619 2.442823 -1.237497
C  0.806027 0.935297 -1.079081
C  -1.469567 -0.669116 1.064755
C  -2.889178 -0.319666 -0.883815
C  1.975704 0.090096 -0.58966
C  -1.891719 -2.013097 1.138381
C  -3.319147 -1.665335 -0.809372
C  3.177478 0.696785 -0.142798
C  1.872464 -1.323972 -0.565011
C  -2.823168 -2.518665 0.201048
C  4.254835 -0.095538 0.312603
C  2.950685 -2.118025 -0.112467
C  4.147083 -1.505827 0.326937
H  -1.694988 1.921873 2.220876
H  -3.13559 2.40982 1.274657
H  -1.667445 3.451012 1.314158
H  -1.531778 3.471857 -1.212772
H  -1.59053 1.959309 -2.169623
H  -3.034486 2.516904 -1.272334
H  0.087664 0.312626 -1.637793
H  1.176875 1.718088 -1.77277
H  -0.743399 -0.29431 1.797016
H  -3.288307 0.318639 -1.678752
H  -1.49323 -2.665005 1.923846
H  -4.04112 -2.04499 -1.541567
H  3.260384 1.788633 -0.140198
H  0.94324 -1.80378 -0.896214
H  -3.15518 -3.561303 0.25733
H  5.177568 0.386763 0.65484
H  2.856969 -3.210006 -0.104606
H  4.985216 -2.119723 0.675887
