program: Gaussian 09
title: 000238539
version: EM64L-G09RevD.01
frameworkgroup: C1[X(C12H27FSi)]
method: RPBEPBE
basis: SDD
operation: Freq
keyword: #p
keyword: freq=noraman
keyword: PBEPBE/SDD
title: #p freq=noraman PBEPBE/SDD
converged: YES YES NO NO
title: Mulliken charges:
elementType: Si F C C C C C C C C C C C C H H H H H H H H H H H H H H H H H H H H H H H H H H H
charge: 1.423550 -0.444465 -0.880223 -0.877079 -0.879973 -0.332311 -0.312204 -0.312753 -0.337976 -0.339934 -0.339399 -0.692532 -0.694596 -0.694619 0.241140 0.243316 0.232551 0.240917 0.242322 0.231877 0.197332 0.197452 0.190699 0.218713 0.218070 0.190892 0.195595 0.195642 0.188763 0.195480 0.195561 0.188658 0.208796 0.219214 0.208605 0.212749 0.216368 0.207340 0.207330 0.216503 0.212628
chargesum: 0.00000
title: Mulliken charges with hydrogens summed into heavy atoms:
elementType: Si F C C C C C C C C C C C C
charge: 1.423550 -0.444465 -0.395767 -0.403611 -0.405774 0.062473 0.097208 0.096209 0.053261 0.044309 0.044821 -0.055917 -0.058138 -0.058158
polarizability: 1.81129387e+02 8.22653576e-02 1.52414041e+02 1.64970366e-02 2.15834119e+00 1.29130761e+02
1716.lowfreq: -8.1464 -0.0014 0.0005 0.0007 2.8755 8.6690 23.7239 26.6245 44.9310
frequency: 23.2577 26.4615 44.8549 46.0384 58.4446 73.6618 76.2847 89.3346 104.6752 117.3979 122.6951 134.6870 175.4490 196.6382 205.6938 208.6544 211.5391 229.0131 229.4267 233.1131 248.3128 317.7953 377.2603 392.2065 405.2919 421.1030 636.6816 678.0623 690.8474 708.5322 732.9187 733.6042 747.2807 764.1866 774.1952 802.4907 865.7700 879.0309 880.3839 889.6133 893.6499 896.0603 1011.2812 1013.0649 1019.6648 1020.9009 1032.4771 1040.8982 1065.0376 1065.1814 1069.9066 1087.4783 1090.9363 1096.8982 1200.0295 1201.4212 1204.2298 1211.3684 1212.6120 1220.1232 1269.1508 1270.5970 1274.8284 1295.9060 1298.9022 1300.1035 1301.5048 1303.3459 1305.3484 1344.4304 1348.1599 1349.5254 1390.3148 1390.4831 1390.6880 1424.5695 1431.2461 1437.2446 1464.6946 1466.3798 1468.2117 1474.3806 1474.9030 1476.4684 1476.9438 1477.0875 1477.9105 1485.9540 1486.2003 1487.2574 2952.9852 2957.8480 2959.4568 2962.4361 2964.4885 2970.0398 2970.4569 2971.4847 2972.5281 2972.6774 2972.9475 2981.2679 2993.5135 3000.4791 3001.3991 3016.1010 3018.3351 3023.8196 3037.7137 3039.8749 3042.5145 3068.7462 3069.1998 3069.5207 3072.3795 3072.4672 3072.6576
redmass: 3.3513 3.5418 4.1235 2.0270 1.6844 1.5289 2.3595 2.8633 3.3127 2.3613 2.1985 2.0905 3.6296 2.0057 2.0323 4.1884 2.3619 1.3201 1.3231 1.2424 3.3841 3.6311 2.9512 2.9023 4.1715 3.0676 4.1943 1.3048 1.9387 1.2533 1.6538 1.3752 1.2608 1.3736 1.6650 6.3209 1.2513 1.5417 1.6867 1.8077 1.4720 1.4374 2.1564 3.6773 2.6697 1.6682 1.1567 1.1989 2.5994 2.5858 2.6406 1.8537 1.8858 1.9713 1.5357 1.5285 1.5046 1.3931 1.4223 1.3651 1.2018 1.1978 1.1924 1.0765 1.1702 1.0739 1.2068 1.3387 1.3348 1.5077 1.5115 1.5084 1.2144 1.2140 1.2143 1.0774 1.0793 1.0775 1.0685 1.0664 1.0655 1.0695 1.0703 1.0696 1.0424 1.0424 1.0426 1.0764 1.0777 1.0802 1.0586 1.0593 1.0595 1.0595 1.0593 1.0604 1.0577 1.0601 1.0380 1.0368 1.0369 1.0586 1.0988 1.0961 1.0964 1.1006 1.1005 1.1024 1.1029 1.1026 1.1015 1.1005 1.1005 1.1006 1.0995 1.0992 1.0996
irintensity: 0.0829 0.0048 0.1160 0.7386 0.1766 0.1721 1.3408 1.3002 0.8769 0.3595 0.2869 0.0572 0.1182 1.9068 1.6850 5.3992 3.1053 0.7444 0.7779 0.0101 2.4825 4.8660 0.2011 1.0086 32.3239 8.1097 5.9674 6.3008 3.1011 3.0250 33.5932 57.8341 7.6486 14.2839 28.4348 61.7348 9.4254 2.2215 15.5130 21.2493 13.5504 23.3255 8.7090 6.1765 4.7562 8.6492 6.7975 7.4982 16.2074 20.9970 0.1937 59.6373 22.0897 1.3904 0.5831 0.2547 0.5139 11.6006 46.4601 10.4823 2.5169 1.5153 3.3327 0.0973 1.2064 0.1936 1.9542 4.5656 0.3157 0.1807 0.1392 0.8009 15.0665 12.5626 10.7069 2.4812 19.3960 14.7495 0.1176 0.5066 0.1194 5.4329 2.4379 2.0046 11.5962 13.6085 13.2051 24.3723 18.8615 1.8336 7.5307 1.5258 3.5302 0.3481 2.3280 16.0129 19.5712 152.9174 34.6727 51.4672 16.8948 53.2721 3.2285 2.6170 4.7658 0.0710 0.7382 7.0250 10.8210 86.0659 41.3928 67.5886 139.3424 42.9044 42.2720 49.2766 65.6437
temp: 298.150 k
press: 1.00000 atm
elementType: 14 9 6 6 6 6 6 6 6 6 6 6 6 6 1 1 1 1 1 1 1 1 1 1 1 1 1 1 1 1 1 1 1 1 1 1 1 1 1 1 1
symmnumber: 1
zpe: 958544.9 jmol-1
zpe.correction: 0.365090 hartree
zpe.thermalcorrener: 0.385884 hartree
zpe.thermalcorrenthalpy: 0.386828 hartree
zpe.thermalcorrgfe: 0.312935 hartree
zpe.sumelectzpe: -861.589992 hartree
zpe.sumelectthermal: -861.569198 hartree
zpe.sumelectthermalent: -861.568254 hartree
zpe.sumelectthermalfe: -861.642147 hartree
dipole: -0.1053 1.7953 -2.0571
dipole: 2.7323
quadrupole: -95.5677 -99.8730 -101.9393
quadrupole: 0.3059 -0.3693 4.9039
quadrupole: 3.5590 -0.7463 -2.8126 0.3059 -0.3693 4.9039
hfenergy: -861.9550824 hartree
pointgroup: C01 [X(C12H27F1Si1)]
dipole: -0.0441728 -0.7054041 0.809957 debye
polarizability: 181.1275786|-0.2335827|152.4193491|-0.0718958|2.1391999|129.1272609 unknown
InChI: InChI=1S/C12H27FSi/c1-4-7-10-14(13,11-8-5-2)12-9-6-3/h4-12H2,1-3H3
charge 0 multiplicity 1
41 atoms
Si 0.063067 0.757317 -0.244861
F  0.125006 1.841271 -1.609334
C  -0.019746 -1.00353 -0.97512
C  1.662365 1.088782 0.740697
C  -1.509081 1.231492 0.725391
C  -0.15995 -2.117029 0.097657
C  2.968735 0.780834 -0.036774
C  -2.836276 1.00455 -0.044277
C  -0.227771 -3.537424 -0.51321
C  4.243526 1.135585 0.764615
C  -4.081275 1.44093 0.76387
C  -0.377904 -4.643171 0.553916
C  5.543553 0.826916 -0.009285
C  -5.403687 1.210135 0.000987
H  0.888945 -1.182711 -1.584457
H  -0.873102 -1.054714 -1.68123
H  1.63731 0.502735 1.683337
H  1.659778 2.156212 1.044506
H  -1.426879 2.301262 1.0086
H  -1.526117 0.663808 1.6797
H  0.694697 -2.075407 0.805402
H  -1.073986 -1.947102 0.704823
H  3.004083 -0.295258 -0.307552
H  2.972611 1.343358 -0.992066
H  -2.810687 1.563644 -1.001272
H  -2.941153 -0.067798 -0.311946
H  0.687965 -3.716389 -1.1124
H  -1.078219 -3.583905 -1.223333
H  4.237727 0.578102 1.723826
H  4.2144 2.212112 1.029738
H  -3.98337 2.514466 1.024452
H  -4.102688 0.887672 1.725331
H  -1.304216 -4.503353 1.142713
H  -0.419852 -5.646841 0.092575
H  0.473693 -4.631595 1.260332
H  5.583273 1.394758 -0.957835
H  6.439363 1.092701 0.581604
H  5.610936 -0.248868 -0.259752
H  -5.539608 0.139516 -0.243681
H  -6.276775 1.533526 0.597134
H  -5.415787 1.77501 -0.950125
