program: Gaussian 09
title: 000238534
version: EM64L-G09RevD.01
frameworkgroup: C1[X(C16H34N2)]
method: RPBEPBE
basis: SDD
operation: Freq
keyword: #pfreq=noraman
keyword: PBEPBE/SDD
title: #p freq=noraman PBEPBE/SDD
converged: YES YES NO NO
title: Mulliken charges:
elementType: N N C C C C C C C C C C C C C C C C H H H H H H H H H H H H H H H H H H H H H H H H H H H H H H H H H H
charge: -0.334010 0.026701 -0.374426 -0.372337 -0.371824 -0.352252 -0.391577 -0.367386 -0.357930 -0.388305 -0.353396 -0.356626 -0.342976 -0.425071 -0.354806 -0.695959 -0.274602 -0.696060 0.193996 0.189688 0.189275 0.190595 0.192709 0.194288 0.187220 0.188336 0.218254 0.182503 0.190793 0.207318 0.184054 0.183719 0.200289 0.186811 0.187944 0.186472 0.195445 0.194772 0.228028 0.197826 0.201302 0.217897 0.193479 0.194309 0.209423 0.209944 0.215395 0.244325 0.193001 0.210035 0.214234 0.209164
chargesum: 0.00000
title: Mulliken charges with hydrogens summed into heavy atoms:
elementType: N N C C C C C C C C C C C C C C C C
charge: -0.089685 0.026701 0.009258 0.007533 0.015173 0.023304 0.009180 0.030725 0.009843 -0.001205 0.021019 0.033591 0.082878 -0.005872 0.032982 -0.061197 -0.081601 -0.062627
polarizability: 2.63166976e+02 -1.45837327e+01 1.77196379e+02 1.92343049e-01 -2.14007181e+00 1.57765810e+02
1716.lowfreq: -5.1182 -3.5561 -0.0010 -0.0007 0.0008 4.3947 11.0434 23.1143 31.8714
frequency: 10.2278 23.0392 31.7166 32.1956 45.6412 48.9061 55.7056 76.2471 80.7351 98.0389 98.9268 106.2557 114.2124 132.6343 144.0237 146.9962 167.8343 183.5898 186.0011 222.0358 228.9697 232.8051 234.6392 258.1530 289.8583 353.7782 375.5141 404.5598 427.1508 456.8909 489.5883 509.2729 547.6171 584.6398 720.6986 721.3326 728.2461 732.6968 748.9905 775.8343 791.9776 823.8723 858.3294 861.7974 880.7060 888.0042 896.3013 935.0580 946.4239 979.9281 992.1370 999.4150 1008.5028 1013.2940 1021.4618 1037.1255 1056.2849 1060.1899 1070.5120 1077.7644 1079.3687 1081.9530 1086.8180 1113.3696 1123.2372 1139.4055 1169.9661 1172.4762 1187.9971 1195.1481 1197.0670 1218.7095 1227.1980 1236.5922 1247.0965 1257.0919 1261.7802 1275.1913 1276.6980 1279.6329 1282.0709 1288.1018 1290.0738 1292.1708 1294.7907 1296.8379 1306.5627 1325.2304 1332.4322 1341.5168 1352.3853 1353.2067 1354.3834 1358.7270 1368.4330 1387.5198 1388.6393 1450.2645 1460.5719 1460.6091 1461.2335 1462.0583 1465.1616 1466.3534 1468.9901 1473.8089 1475.8430 1476.6177 1477.9462 1481.8843 1482.5522 1484.7171 1487.8269 1488.4277 1492.6541 1603.1385 2906.0081 2938.9839 2946.6470 2948.8563 2950.9814 2951.6991 2952.4870 2954.5842 2957.4130 2959.5155 2963.8849 2964.2741 2967.9654 2968.7336 2970.7457 2971.7039 2983.5495 2985.3101 2993.4229 2995.8184 3005.4007 3005.5389 3018.9891 3023.9388 3031.5722 3037.6731 3041.7141 3047.0729 3058.8166 3067.3805 3068.7799 3069.4896 3070.2698 3360.2688
redmass: 4.2327 3.6072 1.7823 3.1282 3.4361 1.5764 2.3116 2.8495 2.3105 3.3905 2.6714 1.7922 1.8588 2.0745 2.0972 2.0156 3.3328 3.8848 2.7978 3.4171 1.5788 1.4639 1.1184 3.7096 2.9513 3.4389 3.5712 2.6621 3.1072 2.8339 2.8420 1.6914 3.5189 1.8842 1.0659 1.0609 1.0783 1.1117 1.1108 1.1981 1.1693 1.6679 1.2193 1.3196 1.7478 1.8986 1.6798 1.2401 1.4697 2.9262 3.0395 2.1806 1.8988 1.3460 2.5484 2.9271 2.6870 2.6259 2.5607 2.3200 2.2217 2.1889 2.2073 2.1402 2.7176 2.3291 2.0791 2.2649 1.5835 1.6390 1.4217 1.3356 1.3841 1.3441 1.2959 1.2642 1.2706 1.1992 1.0787 1.0694 1.0922 1.1920 1.1804 1.1093 1.1716 1.1701 1.2849 1.4165 1.3959 1.4875 1.6109 1.6616 1.6363 1.5887 1.5150 1.2181 1.2169 1.0892 1.0751 1.0746 1.0732 1.0686 1.0685 1.0771 1.0796 1.0801 1.0782 1.0429 1.0427 1.1167 1.0833 1.3533 1.0879 1.0927 1.0887 7.0589 1.0711 1.0836 1.0595 1.0628 1.0588 1.0588 1.0593 1.0608 1.0608 1.0636 1.0606 1.0602 1.0594 1.0586 1.0363 1.0367 1.0970 1.0965 1.0983 1.0987 1.1002 1.1014 1.1011 1.1039 1.1011 1.1028 1.1021 1.0968 1.0950 1.1007 1.1007 1.0993 1.0993 1.0740
irintensity: 0.0042 0.0859 0.1621 0.1757 0.0980 0.0199 1.3503 0.1112 0.6098 0.5091 0.0590 2.4805 0.6547 0.0311 0.8609 1.5722 0.9093 12.4290 23.2410 9.1370 0.2795 0.3948 0.0032 0.3977 3.2162 0.0657 1.8268 6.9507 3.8046 12.0963 21.8536 62.1547 1.1543 50.4965 12.3476 15.4472 0.1463 0.5025 4.4922 6.6286 0.4098 12.9201 2.3909 1.2967 8.8180 5.3056 20.6391 4.0147 3.9017 5.3591 0.5225 7.1506 1.3690 0.2864 1.9470 5.8222 5.1016 31.4223 10.1479 0.3613 0.4191 9.0603 0.4957 18.8572 1.2009 75.7891 28.6763 46.2004 0.9343 1.0540 7.5485 6.1163 0.0523 1.4422 0.7059 0.5570 0.6450 0.4269 0.2201 0.4844 0.5258 0.5791 0.6762 0.6160 6.2746 12.6011 7.6956 15.5190 0.3778 10.5748 0.4864 0.7964 0.3607 0.3087 14.0837 11.1226 11.4267 12.6869 0.7704 0.3839 0.0106 0.1990 0.2818 0.8464 0.4006 1.6303 2.9863 12.1168 12.2871 2.5316 0.7173 23.4565 19.9162 28.9061 19.6529 38.8380 87.3834 60.9013 2.9638 16.1875 0.0627 0.6405 5.5187 5.1671 0.9453 18.1336 3.2030 36.7325 189.1190 200.9134 39.9336 34.8484 1.0279 0.9884 1.2295 3.5689 1.9743 7.5041 2.7289 3.7504 5.3878 96.2081 128.3695 89.1025 75.7518 98.1397 101.0334 57.4564 55.2909 8.4619
temp: 298.150 k
press: 1.00000 atm
elementType: 7 7 6 6 6 6 6 6 6 6 6 6 6 6 6 6 6 6 1 1 1 1 1 1 1 1 1 1 1 1 1 1 1 1 1 1 1 1 1 1 1 1 1 1 1 1 1 1 1 1 1 1
symmnumber: 1
zpe: 1242473.3 jmol-1
zpe.correction: 0.473233 hartree
zpe.thermalcorrener: 0.497794 hartree
zpe.thermalcorrenthalpy: 0.498738 hartree
zpe.thermalcorrgfe: 0.413727 hartree
zpe.sumelectzpe: -738.053895 hartree
zpe.sumelectthermal: -738.029334 hartree
zpe.sumelectthermalent: -738.028390 hartree
zpe.sumelectthermalfe: -738.113400 hartree
dipole: -0.6259 0.6841 1.5357
dipole: 1.7939
quadrupole: -114.1885 -120.0475 -114.5284
quadrupole: -1.9931 1.7051 -1.7628
quadrupole: 2.0663 -3.7927 1.7264 -1.9931 1.7051 -1.7628
hfenergy: -738.5271278 hartree
pointgroup: C01 [X(C16H34N2)]
dipole: 0.260197 0.2786015 -0.5939821 debye
polarizability: 264.4319396|10.0900802|175.7458494|0.7688024|2.8085587|157.951375 unknown
InChI: InChI=1S/C16H34N2/c1-3-5-7-9-11-13-15-17-18-16-14-12-10-8-6-4-2/h15,18H,3-14,16H2,1-2H3
charge 0 multiplicity 1
52 atoms
N  -0.051933 -1.398597 -0.473851
N  -1.20381 -1.708304 0.221745
C  4.873824 -0.252791 -0.353447
C  6.004997 0.509337 0.37297
C  3.489863 -0.074879 0.310784
C  7.387959 0.328561 -0.292883
C  2.368226 -0.847368 -0.418645
C  -4.761435 -0.220444 0.254856
C  -6.019279 0.554972 -0.19644
C  -4.798948 -1.714441 -0.135397
C  -5.997615 2.047816 0.20308
C  8.522271 1.087847 0.432761
C  0.993489 -0.669512 0.255915
C  -3.5317 -2.501932 0.297326
C  -7.256456 2.821654 -0.250915
C  9.899187 0.901239 -0.240902
C  -2.283168 -2.070436 -0.435584
C  -7.229173 4.311646 0.153734
H  5.125242 -1.333342 -0.390078
H  4.820854 0.089549 -1.408326
H  5.754803 1.590469 0.409633
H  6.058843 0.167261 1.427757
H  3.235772 1.005181 0.34468
H  3.543412 -0.415466 1.365674
H  7.335923 0.671748 -1.347555
H  7.638598 -0.752429 -0.330697
H  2.611258 -1.927363 -0.453229
H  2.31589 -0.499007 -1.472578
H  -4.649681 -0.136095 1.355997
H  -3.857089 0.250502 -0.181245
H  -6.922076 0.074241 0.236454
H  -6.124769 0.473198 -1.299121
H  -5.689799 -2.190244 0.323333
H  -4.930065 -1.804854 -1.234721
H  -5.894788 2.130939 1.305431
H  -5.095983 2.530955 -0.228726
H  8.574395 0.744234 1.486134
H  8.271319 2.167757 0.470626
H  1.011012 -1.079344 1.281281
H  0.757866 0.41686 0.343352
H  -3.709734 -3.583577 0.115598
H  -3.357196 -2.380577 1.382824
H  -7.357271 2.738462 -1.3526
H  -8.156259 2.336621 0.180045
H  9.880657 1.264083 -1.286074
H  10.187992 -0.166703 -0.262848
H  10.692251 1.45467 0.295055
H  -0.104051 -1.253492 -1.495114
H  -2.31711 -2.096735 -1.547188
H  -7.158202 4.422159 1.252462
H  -8.140462 4.840827 -0.181226
H  -6.35635 4.82674 -0.290617
