program: Gaussian 09
title: 000238532
version: EM64L-G09RevD.01
frameworkgroup: C1[X(C16H16N2O2)]
method: RPBEPBE
basis: SDD
operation: Freq
keyword: #p
keyword: freq=noraman
keyword: PBEPBE/SDD
title: #p freq=noraman PBEPBE/SDD
converged: YES YES NO NO
title: Mulliken charges:
elementType: O O N N C C C C C C C C C C C C C C C C H H H H H H H H H H H H H H H H
charge: -0.254353 -0.254206 -0.338499 -0.338323 -0.618961 -0.618916 0.404635 0.404408 0.225823 0.225626 -0.374349 -0.374085 -0.426671 -0.426718 -0.229813 -0.229894 -0.220709 -0.220737 -0.242984 -0.243051 0.257516 0.247889 0.257495 0.247852 0.283065 0.283219 0.234142 0.234134 0.357781 0.357737 0.235596 0.235614 0.228467 0.228445 0.231424 0.231401
chargesum: 0.00000
title: Mulliken charges with hydrogens summed into heavy atoms:
elementType: O O N N C C C C C C C C C C C C C C C C
charge: -0.254353 -0.254206 0.019283 0.019415 -0.113557 -0.113569 0.404635 0.404408 0.225823 0.225626 -0.091284 -0.090866 -0.192529 -0.192585 0.005783 0.005720 0.007758 0.007708 -0.011560 -0.011650
polarizability: 2.35262236e+02 2.11221241e+01 1.84326597e+02 7.17444479e-03 -4.91068642e-03 1.33089722e+02
1716.lowfreq: -12.0162 -8.0966 0.0002 0.0006 0.0006 3.3304 6.7476 27.2702 29.6216
frequency: -0.9790 25.7821 29.4892 38.4031 53.5293 57.1946 64.3362 87.3389 127.7862 185.6797 246.9135 287.4996 301.2045 303.8379 325.0945 342.2016 369.8288 404.2305 404.3287 453.4146 473.2818 521.4446 542.7682 557.8906 592.1812 611.7529 612.5127 621.2448 621.4089 639.9580 701.8476 707.2638 715.0745 756.2797 764.4429 819.1827 819.8727 858.9122 859.5923 905.7671 907.7274 920.2040 934.3055 944.4009 947.4105 980.1069 980.3242 990.2402 990.2961 999.6827 999.7261 1027.8101 1027.8635 1084.9753 1085.1595 1132.4384 1173.0101 1173.6367 1176.0081 1188.2900 1195.0912 1196.0433 1196.0871 1214.0502 1224.0255 1270.1393 1293.4829 1300.1831 1337.0922 1337.1345 1379.0484 1379.1401 1434.1670 1435.7397 1443.4844 1447.8798 1455.3486 1474.9102 1485.6755 1486.0407 1589.9655 1590.1062 1608.8762 1612.2230 1614.8056 1635.8649 2999.9530 2999.9727 3052.3775 3052.4476 3118.0193 3118.0570 3123.5544 3123.5673 3135.1068 3135.1286 3147.9903 3148.0169 3164.9110 3164.9847 3510.8878 3518.1191
redmass: 5.0530 4.8047 3.9944 4.6034 6.9479 5.6971 6.9064 4.4333 5.1893 4.8335 3.9037 2.8217 3.0540 2.7084 5.2566 8.0491 6.5762 2.8141 2.8189 3.3706 3.2251 1.3066 3.7053 3.9369 3.3657 2.6041 5.1575 5.1540 4.1571 2.2472 3.0585 1.8625 1.8204 1.7604 2.1166 3.9827 3.9547 1.2529 1.2539 1.6547 1.6122 3.9948 2.7403 1.9193 2.6016 1.4733 1.4818 4.5812 4.4684 1.3422 1.3448 2.2265 2.2269 1.6200 1.6243 5.0168 1.1187 1.0618 1.3283 1.2460 1.7142 1.2524 1.3006 1.8292 2.1244 2.8545 1.6150 1.7187 1.2753 1.2757 7.5048 7.4973 1.3830 1.5213 1.6858 1.3966 1.4213 1.5540 2.2602 2.2314 5.9501 5.9326 7.9705 5.9987 6.4691 7.7976 1.0605 1.0605 1.0993 1.0994 1.0873 1.0873 1.0880 1.0880 1.0913 1.0913 1.0958 1.0958 1.1015 1.1015 1.0804 1.0774
irintensity: 0.0393 2.4023 0.0977 0.4553 0.3458 4.8308 4.3474 6.1761 2.5650 0.4997 7.4630 7.4455 0.2504 0.8589 1.4173 0.5979 31.9130 0.6061 0.2123 5.0105 28.4772 34.0302 7.0289 3.1005 20.9584 111.5305 0.8540 2.6204 33.5591 2.0367 13.1953 50.9380 69.9715 32.5339 19.7710 4.2793 6.6455 1.8007 0.0152 5.5087 3.8229 3.3343 15.4239 0.0439 0.0914 0.6589 0.0808 0.1364 0.0603 0.6606 0.1125 8.4093 5.1560 9.1083 10.0722 7.0359 14.1737 0.0241 44.5373 0.2145 51.5879 0.1708 0.9809 3.4427 38.2913 16.7339 3.7553 0.0518 0.9351 1.2442 0.0266 0.0279 44.9917 11.5318 139.2162 0.3206 58.6206 58.0531 40.5677 0.0975 6.8772 5.3977 302.4329 8.9105 37.4844 96.0084 5.4034 16.4926 2.1236 3.7567 4.5394 8.6342 0.3539 0.2340 10.1561 9.2979 29.4752 27.0882 43.7486 4.3674 11.6757 92.4973
temp: 298.150 k
press: 1.00000 atm
elementType: 8 8 7 7 6 6 6 6 6 6 6 6 6 6 6 6 6 6 6 6 1 1 1 1 1 1 1 1 1 1 1 1 1 1 1 1
symmnumber: 1
zpe: 751398.9 jmol-1
zpe.correction: 0.286193 hartree
zpe.thermalcorrener: 0.303337 hartree
zpe.thermalcorrenthalpy: 0.304282 hartree
zpe.thermalcorrgfe: 0.238484 hartree
zpe.sumelectzpe: -877.830099 hartree
zpe.sumelectthermal: -877.812954 hartree
zpe.sumelectthermalent: -877.812010 hartree
zpe.sumelectthermalfe: -877.877808 hartree
dipole: 0.0080 -0.0098 3.4626
dipole: 3.4626
quadrupole: -97.2441 -113.8751 -119.1922
quadrupole: -2.0864 -0.0124 0.0133
quadrupole: 12.8597 -3.7713 -9.0884 -2.0864 -0.0124 0.0133
hfenergy: -878.1162917 hartree
pointgroup: C01 [X(C16H16N2O2)]
dipole: 0.0149644 -1.362062 -0.0212416 debye
polarizability: 216.7424302|0.2075599|133.1007734|32.3530829|-0.6963103|202.8353517 unknown
InChI: InChI=1S/C16H16N2O2/c19-15(11-13-7-3-1-4-8-13)17-18-16(20)12-14-9-5-2-6-10-14/h1-10,17-18H,11-12H2
charge 0 multiplicity 1
36 atoms
O  0.582232 1.330524 -1.746562
O  -0.608714 1.269564 1.788086
N  0.696514 -0.299745 -0.086945
N  -0.693489 -0.314407 0.082409
C  2.807484 0.73707 -0.880452
C  -2.822497 0.663922 0.900855
C  3.47941 0.267886 0.40412
C  -3.483744 0.222136 -0.398907
C  1.273617 0.645445 -0.942146
C  -1.287384 0.59624 0.963223
C  3.073024 0.78143 1.667026
C  -3.082767 0.779337 -1.644948
C  4.551528 -0.659154 0.358756
C  -4.54048 -0.723389 -0.384104
C  3.730311 0.376126 2.849575
C  -3.730424 0.398444 -2.840832
C  5.210314 -1.064236 1.542419
C  -5.189714 -1.103957 -1.581115
C  4.801595 -0.546386 2.792523
C  -4.786606 -0.542686 -2.814183
H  3.031241 1.802849 -1.073669
H  3.202589 0.179168 -1.7508
H  -3.064273 1.719628 1.125121
H  -3.20997 0.073713 1.753141
H  2.235522 1.48776 1.727299
H  -2.256722 1.500595 -1.682094
H  4.875265 -1.062864 -0.608687
H  -4.859807 -1.160856 0.570035
H  1.252884 -0.72026 0.662384
H  -1.242356 -0.722908 -0.67901
H  3.403889 0.780035 3.81422
H  -3.408255 0.835913 -3.792175
H  6.038498 -1.779663 1.487843
H  -6.00611 -1.834185 -1.550062
H  5.310774 -0.857633 3.711383
H  -5.288377 -0.834858 -3.743322
