program: Gaussian 09
title: 000021105
version: EM64L-G09RevD.01
frameworkgroup: C1[X(C13H25N)]
method: RPBEPBE
basis: SDD
operation: Freq
keyword: #pfreq=noraman
keyword: PBEPBE/SDD
title: #p freq=noraman PBEPBE/SDD
converged: NO YES NO NO
title: Mulliken charges:
elementType: N C C C C C C C C C C C C C H H H H H H H H H H H H H H H H H H H H H H H H H
charge: -0.092489 -0.001392 -0.422911 -0.437077 -0.422779 -0.405287 -0.405014 -0.383122 -0.366883 -0.345800 -0.432782 -0.362801 -0.349499 -0.397899 0.202575 0.173302 0.200575 0.185180 0.193435 0.225408 0.177859 0.195347 0.191266 0.187417 0.195590 0.196259 0.187043 0.209400 0.181518 0.184320 0.194275 0.204489 0.193266 0.176867 0.202161 0.201905 0.182074 0.185094 0.199108
chargesum: 0.00000
title: Mulliken charges with hydrogens summed into heavy atoms:
elementType: N C C C C C C C C C C C C C
charge: -0.092489 0.201183 -0.049034 -0.058462 -0.019513 -0.018673 -0.022007 0.000180 0.024035 0.032795 -0.035027 0.016227 0.034481 -0.013696
polarizability: 1.67364252e+02 -2.34037338e+00 1.31173751e+02 2.82661651e+00 4.27534969e-01 1.28253579e+02
1716.lowfreq: -20.7032 -16.9328 -7.1472 -0.0004 -0.0003 0.0004 20.7613 41.1642 65.9008
frequency: 20.0062 37.1046 65.6574 98.6055 143.5989 171.6640 207.7278 230.3116 247.7072 266.2105 302.2330 316.8367 344.7790 368.4908 401.0029 425.5130 432.8566 462.1871 486.0811 562.6354 564.1802 712.4103 772.7599 785.9834 787.6786 807.1537 832.5698 842.4981 846.4048 876.5733 886.7354 893.6681 914.0175 952.6219 954.6394 967.0222 985.8090 1006.8071 1044.4544 1051.4295 1056.3253 1072.8408 1083.2783 1098.3779 1112.0728 1118.5856 1128.6642 1141.8552 1169.3868 1177.3587 1186.3790 1212.8274 1226.7499 1236.2148 1248.1437 1256.2745 1260.7512 1275.1688 1279.0330 1291.7660 1304.1641 1309.3057 1328.7686 1331.0219 1336.1205 1338.9256 1340.8534 1342.0455 1347.1661 1351.6605 1355.5901 1358.2408 1378.1348 1386.8857 1445.2717 1451.2812 1460.2866 1460.7963 1462.1096 1462.7608 1464.9469 1467.2223 1468.0471 1475.4517 1479.0868 1488.0673 2805.9923 2817.8247 2894.4427 2944.4136 2949.5635 2949.8444 2958.7166 2961.9226 2962.5057 2963.7702 2966.5704 2971.4481 2976.6944 2982.7551 3002.5407 3010.6948 3013.4346 3022.3518 3023.0195 3024.0064 3029.7784 3032.2255 3034.0195 3041.1488 3041.4824
redmass: 3.1616 2.9708 2.9455 2.7429 2.6483 2.0192 2.2113 1.7945 2.9569 3.1399 1.9644 1.7745 2.5812 2.2884 2.5112 2.2209 2.7433 2.0252 1.4984 1.9139 2.4958 2.7897 2.3655 1.6851 1.8894 1.5963 1.8425 2.4849 1.5862 1.8826 1.9397 1.5103 1.7895 1.5413 2.3077 2.3154 2.0201 1.6124 1.8494 1.9259 1.1022 1.6300 1.7539 2.0763 2.5571 2.5142 1.9781 2.0358 1.5472 1.6106 1.6053 1.3360 1.6110 1.3957 1.2363 1.2834 1.3306 1.2126 1.2097 1.2405 1.3523 1.3072 1.2699 1.3725 1.3793 1.5229 1.4765 1.4641 1.3960 1.4651 1.4732 1.4454 1.3332 1.3723 1.0899 1.0850 1.0878 1.0894 1.0854 1.0891 1.0896 1.0924 1.0811 1.0925 1.0794 1.0913 1.0704 1.0713 1.0695 1.0762 1.0623 1.0618 1.0691 1.0594 1.0624 1.0666 1.0635 1.0612 1.0685 1.0810 1.0892 1.0968 1.0971 1.0909 1.0963 1.0985 1.0985 1.1007 1.0999 1.1007 1.1000
irintensity: 0.1103 0.0933 0.0188 0.8033 0.0553 0.1861 0.6073 0.1431 0.4470 2.2575 0.7707 0.6851 0.7258 1.0201 1.9787 0.7444 0.0569 1.5669 1.4321 1.3049 1.5338 4.7216 0.3702 0.6806 2.8270 2.8282 3.0535 6.8315 4.5953 3.4065 12.7145 7.0028 0.7880 5.0289 0.5523 12.9830 5.4223 3.2766 5.1709 9.4210 0.4201 3.7260 8.5927 1.8945 6.0583 18.6536 27.7813 6.0099 10.2060 6.0212 3.9837 4.1746 7.6646 7.1372 4.0276 1.0993 5.4453 4.6005 4.0490 1.9247 11.5649 1.2689 14.2297 0.4050 1.5754 0.4233 0.7454 0.5109 3.7575 2.1420 1.9905 4.3255 3.8821 0.4853 7.7977 3.4621 3.2582 7.0330 9.4512 6.9769 6.3153 11.3123 20.7807 0.4688 12.6078 7.7427 86.8845 148.0114 89.6868 8.6492 32.9408 23.4374 24.3970 44.6656 24.6701 36.8636 67.0428 33.5599 34.9377 32.1786 6.7894 74.6310 74.1929 81.5478 56.0737 80.4104 21.0923 19.5243 43.6097 146.8406 110.8187
temp: 298.150 k
press: 1.00000 atm
elementType: 7 6 6 6 6 6 6 6 6 6 6 6 6 6 1 1 1 1 1 1 1 1 1 1 1 1 1 1 1 1 1 1 1 1 1 1 1 1 1
symmnumber: 1
zpe: 941963.8 jmol-1
zpe.correction: 0.358775 hartree
zpe.thermalcorrener: 0.373138 hartree
zpe.thermalcorrenthalpy: 0.374082 hartree
zpe.thermalcorrgfe: 0.316728 hartree
zpe.sumelectzpe: -563.964350 hartree
zpe.sumelectthermal: -563.949987 hartree
zpe.sumelectthermalent: -563.949043 hartree
zpe.sumelectthermalfe: -564.006398 hartree
dipole: -0.2273 -0.4632 0.3773
dipole: 0.6392
quadrupole: -88.8008 -89.1513 -88.3554
quadrupole: 0.3416 -0.6038 1.2127
quadrupole: -0.0316 -0.3821 0.4138 0.3416 -0.6038 1.2127
hfenergy: -564.3231255 hartree
pointgroup: C01 [X(C13H25N1)]
dipole: -0.0873273 0.1573198 -0.1756782 debye
polarizability: 167.4362727|1.9474129|131.2415805|-2.6130127|-0.0110478|128.1137291 unknown
InChI: InChI=1S/C13H25N/c1-2-7-11-14(10-6-1)12-13-8-4-3-5-9-13/h13H,1-12H2
charge 0 multiplicity 1
39 atoms
N  -1.009416 0.598075 -0.185176
C  1.523577 0.36407 -0.342695
C  0.294961 1.300999 -0.239807
C  2.832149 1.195287 -0.375653
C  1.573547 -0.667589 0.810806
C  4.082596 0.290159 -0.485723
C  2.81484 -1.582936 0.700131
C  4.122702 -0.756153 0.654887
C  -1.301924 -0.142793 -1.435166
C  -2.123694 1.411552 0.36897
C  -2.719168 -0.755732 -1.518184
C  -2.98787 0.612904 1.375569
C  -3.221501 -1.441971 -0.221198
C  -3.91505 -0.454333 0.75103
H  1.469528 -0.197882 -1.300543
H  0.337974 2.026706 -1.097254
H  0.397216 1.893145 0.691162
H  2.899765 1.797253 0.556111
H  2.805979 1.913663 -1.219999
H  0.638167 -1.257626 0.821241
H  1.608258 -0.117685 1.776221
H  5.002268 0.907383 -0.473241
H  4.064422 -0.238088 -1.461933
H  2.73898 -2.192756 -0.224704
H  2.84196 -2.294297 1.54879
H  4.99806 -1.423685 0.532164
H  4.251953 -0.230848 1.624278
H  -0.562177 -0.963749 -1.517401
H  -1.149749 0.509959 -2.336597
H  -2.769278 1.84899 -0.429541
H  -1.677455 2.269601 0.906525
H  -2.701735 -1.487155 -2.350381
H  -3.45386 0.019922 -1.81333
H  -3.611193 1.32433 1.957458
H  -2.289757 0.130024 2.086517
H  -2.375517 -1.944615 0.288144
H  -3.950712 -2.231394 -0.491837
H  -4.735786 0.052245 0.199523
H  -4.397757 -1.02458 1.570434
