program: Gaussian 09
title: 000238512
version: EM64L-G09RevD.01
frameworkgroup: C1[X(C12H9ClN2O)]
method: RPBEPBE
basis: SDD
operation: Freq
keyword: #p
keyword: freq=noraman
keyword: PBEPBE/SDD
title: #p freq=noraman PBEPBE/SDD
converged: YES YES NO NO
title: Mulliken charges:
elementType: Cl O N N C C C C C C C C C C C C H H H H H H H H H
charge: -0.038965 -0.209345 -0.036877 0.018876 -0.637641 0.308541 0.129345 0.249722 -0.335859 -0.340691 -0.231615 -0.218423 -0.389745 -0.099448 -0.288575 -0.250631 0.256757 0.253813 0.291800 0.282867 0.260674 0.262121 0.269236 0.244453 0.249608
chargesum: 0.00000
title: Mulliken charges with hydrogens summed into heavy atoms:
elementType: Cl O N N C C C C C C C C C C C C
charge: -0.038965 -0.209345 -0.036877 0.018876 -0.127070 0.308541 0.129345 0.249722 -0.044059 -0.057824 0.029059 0.043699 -0.120509 -0.099448 -0.044122 -0.001022
polarizability: 2.09041588e+02 -1.17638571e+01 1.62563983e+02 2.47194182e+00 -1.12532192e+01 9.16868697e+01
1716.lowfreq: -6.0390 -3.6222 -0.0017 0.0013 0.0021 8.1394 21.5591 48.0686 54.7882
frequency: 21.1894 48.0604 54.7683 82.5790 91.7311 145.7352 188.2053 245.2037 271.5013 298.0107 342.6817 395.9781 408.9528 431.6620 455.0975 469.8234 521.2551 543.7540 601.8479 621.3103 627.0091 693.7919 735.6150 747.1992 777.6926 822.0684 839.3274 847.2991 874.2799 923.2394 940.9451 959.2318 974.9441 977.5881 990.6382 996.3962 1014.4857 1033.9686 1071.7560 1111.2088 1126.5226 1165.9181 1191.3767 1230.3077 1241.5719 1260.9051 1282.7459 1302.6299 1312.6877 1371.9372 1387.1669 1400.9278 1439.9909 1456.2082 1479.0542 1500.2583 1531.7596 1561.0188 1588.5429 1601.0986 3033.8547 3103.7255 3138.4600 3139.2050 3147.0332 3154.9603 3165.0615 3171.9127 3176.3863
redmass: 8.3219 4.8714 4.8466 10.8791 6.2736 6.3544 5.1587 7.3887 6.6862 7.5307 3.3713 3.6357 2.9313 3.3979 5.1252 4.1811 6.4631 4.6879 5.6395 7.1615 5.8190 4.6374 5.2776 4.0606 2.6264 2.5368 1.2667 1.4301 2.3668 2.3326 1.4740 1.4799 2.6952 1.9502 1.3937 3.6639 2.9937 2.8894 2.7699 1.4489 1.5567 1.7279 1.1600 2.5521 5.7236 2.3533 1.6403 1.2787 1.4018 5.4636 1.8339 3.7889 1.9348 1.1509 2.0975 7.9469 4.6977 8.2875 6.6439 7.2532 1.0584 1.1043 1.0906 1.0895 1.0928 1.0888 1.0996 1.0952 1.0973
irintensity: 0.1498 0.0521 0.7538 4.0205 0.1580 2.0705 3.3172 0.5624 0.1742 0.2594 6.6725 21.7005 0.4569 0.8130 20.1361 12.4485 21.5101 11.1830 4.0340 1.1840 3.6283 0.9507 12.7965 14.7226 25.3895 8.1014 9.6579 60.0040 4.4766 30.1423 0.5131 0.5948 14.4472 3.8972 2.7874 70.8689 12.4482 4.6134 64.1114 7.0179 15.8288 25.7702 21.7160 20.9490 24.7326 258.0841 26.2814 0.7656 15.7707 10.3003 28.3898 21.2210 48.2154 27.5910 19.6462 22.9685 13.0254 125.5124 138.9656 55.3577 7.0605 4.5518 7.6077 2.8697 12.6786 0.3246 31.0683 2.1788 5.5234
temp: 298.150 k
press: 1.00000 atm
elementType: 17 8 7 7 6 6 6 6 6 6 6 6 6 6 6 6 1 1 1 1 1 1 1 1 1
symmnumber: 1
zpe: 477676.4 jmol-1
zpe.correction: 0.181937 hartree
zpe.thermalcorrener: 0.195348 hartree
zpe.thermalcorrenthalpy: 0.196292 hartree
zpe.thermalcorrgfe: 0.139275 hartree
zpe.sumelectzpe: -1106.330597 hartree
zpe.sumelectthermal: -1106.317186 hartree
zpe.sumelectthermalent: -1106.316242 hartree
zpe.sumelectthermalfe: -1106.373259 hartree
dipole: -0.2787 -2.0566 1.4919
dipole: 2.5560
quadrupole: -104.9453 -97.4417 -100.7020
quadrupole: 9.1470 -5.9761 1.5283
quadrupole: -3.9157 3.5880 0.3277 9.1470 -5.9761 1.5283
hfenergy: -1106.5125346 hartree
pointgroup: C01 [X(C12H9Cl1N2O1)]
dipole: -0.206844 0.8306073 0.527765 debye
dipolederiv: -0.674674 -0.034315 -0.3960517 -0.0353296 -0.0958888 -0.0582697 -0.4700598 -0.0629307 -0.4010958 -0.6687429 0.0365832 -0.1230316 0.0580126 -0.5633575 -0.4450212 -0.2584392 -0.2270857 -0.8089791 -0.4071699 0.0177936 0.018085 0.1436315 -0.2832217 -0.0310018 0.2141214 0.0186093 -0.279534 -0.2377792 0.0124603 -0.0445751 -0.0435628 -0.2167354 0.043594 -0.0967235 0.0351038 -0.1291551 -0.7156047 0.2026514 0.2278773 0.34046 -0.0547992 -0.0508215 0.3163676 -0.0406066 -0.0946089 -0.7074936 -0.0139178 -0.3889855 0.1275782 -0.0911359 -0.0472456 -0.4582955 -0.0742131 -0.3307148 1.6268628 -0.2080663 0.4450826 -0.5604863 0.5842493 0.5406928 0.7379674 0.306133 0.8702416 0.609313 -0.0271781 -0.3995857 0.2411469 -0.0151448 -0.2379186 -0.5821705 0.0000708 0.2576545 0.0966595 -0.0715946 0.0716972 0.130923 -0.0567449 0.1335717 0.2568717 0.0300667 0.088789 0.1756238 0.0520896 0.2054125 -0.2073618 -0.0135357 -0.0208582 -0.0066368 0.1108878 0.0486599 -0.5156804 0.0322293 -0.1834873 0.1084543 -0.046644 0.1112134 -0.1565393 0.1011439 -0.1126058 -0.2069427 -0.145368 -0.1840393 -0.1739102 -0.0874598 -0.0767092 -0.2407545 -0.0766977 -0.3240723 -0.207346 0.0430798 0.2310822 -0.149034 0.0916189 0.2962962 0.0707046 0.0415126 0.0819157 0.9651386 -0.0074454 0.6235804 -0.0077829 0.1214229 0.1613899 0.692068 0.1725622 0.5629764 -0.0465067 0.0551933 0.1464306 -0.1890861 0.124172 0.2708199 -0.1285934 0.0921945 0.2014165 0.1629175 -0.010046 -0.259891 0.1514554 -0.0347456 -0.2119412 0.0284059 -0.0234759 0.0470963 0.026671 0.0040329 -0.0642319 -0.0369315 0.0918237 -0.0351777 -0.041513 0.0241 -0.033734 0.0599899 -0.0565602 0.0101663 -0.0744323 -0.0320895 0.0069639 0.0012297 -0.0649146 0.0955033 0.1792602 0.0664298 -0.0126549 0.0680283 0.0932245 -0.0176283 -0.0185246 -0.0201585 0.0953356 0.1385423 -0.0066222 -0.0373247 0.03586 0.0793785 -0.0550927 0.0119007 -0.0787218 0.0660708 0.1005191 0.0180451 -0.0195581 0.0083045 0.0672033 -0.0902722 -0.0319019 -0.0944152 0.0463629 0.0042946 0.0855268 -0.0125403 0.0813717 0.0819538 -0.0314154 -0.0237731 -0.0291175 0.1211838 0.1319407 -0.0010472 0.0257201 0.0075313 0.0832033 -0.0676942 0.0340841 -0.053295 -0.0166527 0.0988637 -0.0231571 0.001495 0.0141944 0.0582189 -0.1063424 0.0546947 -0.0833645 -0.0484192 0.0113434 -0.0207971 0.119328 -0.0390346 0.1150336 0.0188682 0.0955092 -0.0033878 -0.0036347 unknown
polarizability: 203.5520919|0.7876014|107.4906593|20.3537307|32.2236746|152.2496886 unknown
InChI: InChI=1S/C12H9ClN2O/c13-10-3-1-9(2-4-10)12(16)7-11-8-14-5-6-15-11/h1-6,8H,7H2
charge 0 multiplicity 1
25 atoms
Cl 4.855795 0.21347 2.218477
O  0.106505 -1.2069 -2.494835
N  -2.032252 1.185818 0.594319
N  -3.960695 -0.881292 0.210451
C  -1.02885 0.758882 -1.630286
C  1.260518 -0.117818 -0.678727
C  0.131675 -0.264063 -1.651269
C  -2.059857 0.445527 -0.558939
C  1.257458 0.855106 0.358697
C  2.373879 -0.995244 -0.807645
C  2.349205 0.954392 1.246743
C  3.4713 -0.90142 0.067131
C  -3.026946 -0.582499 -0.73847
C  3.440915 0.078762 1.08292
C  -2.96966 0.892397 1.542623
C  -3.925339 -0.133329 1.354841
H  -1.500446 0.706336 -2.625981
H  -0.651417 1.780899 -1.46417
H  0.394065 1.51396 0.500227
H  2.356728 -1.74405 -1.606137
H  2.351111 1.695904 2.050451
H  4.331629 -1.569168 -0.032225
H  -3.051053 -1.177077 -1.657573
H  -2.946719 1.489589 2.459906
H  -4.67185 -0.367681 2.120169
