program: Gaussian 09
title: 000238531
version: EM64L-G09RevD.01
frameworkgroup: C1[X(C16H16N2O)]
method: RPBEPBE
basis: SDD
operation: Freq
keyword: #p
keyword: freq=noraman
keyword: PBEPBE/SDD
title: #p freq=noraman PBEPBE/SDD
converged: YES YES NO NO
title: Mulliken charges:
elementType: O N N C C C C C C C C C C C C C C C C H H H H H H H H H H H H H H H H
charge: -0.221807 -0.390822 0.066532 0.390999 -0.650437 0.483604 -0.582492 -0.382989 -0.379876 0.219143 -0.440587 -0.381920 -0.226340 -0.221575 -0.222101 -0.213863 -0.216154 -0.239063 -0.245745 0.252918 0.253173 0.213052 0.249151 0.242311 0.242195 0.230985 0.250926 0.220808 0.231568 0.231211 0.226184 0.226658 0.232442 0.322844 0.229069
chargesum: 0.00000
title: Mulliken charges with hydrogens summed into heavy atoms:
elementType: O N N C C C C C C C C C C C C C C C C
charge: -0.221807 -0.067978 0.066532 0.390999 -0.144346 0.483604 -0.120290 -0.140678 -0.137682 0.219143 -0.209602 -0.130994 -0.005532 0.009993 0.009110 0.012321 0.010504 -0.006621 -0.016677
polarizability: 2.14546092e+02 2.62178278e+01 1.88485851e+02 -4.21727717e+00 7.61005990e+00 1.69717541e+02
1716.lowfreq: -8.9630 -0.0002 0.0002 0.0007 1.4667 5.1857 12.5176 20.9972 24.0978
frequency: 10.5511 20.9002 23.7062 27.7325 38.2500 55.4442 115.2817 122.6899 169.1802 201.4989 251.0673 291.6790 311.5286 318.0883 350.6568 368.0560 402.5414 404.3262 446.6005 475.0741 540.6687 556.6756 581.6412 603.5117 616.9400 617.0397 636.2961 658.5705 705.3553 706.4890 755.7263 763.2666 798.6454 827.3860 855.9636 858.1183 888.1229 913.2049 918.3965 924.9656 938.3717 942.7380 979.1071 980.3207 989.1839 990.1877 997.1524 998.2211 1026.1819 1026.7474 1044.4555 1081.6811 1081.7690 1100.9414 1171.7356 1172.5869 1175.2832 1178.7843 1187.6625 1189.2141 1199.9381 1204.7538 1215.5138 1281.5806 1289.8315 1326.9351 1327.2770 1335.3536 1379.5603 1382.1897 1439.6072 1439.8009 1448.2574 1451.8189 1482.7243 1483.0580 1498.8142 1589.5676 1591.8164 1601.3559 1611.2704 1613.8488 1643.6287 2970.5037 2988.7985 3008.1497 3057.9570 3062.4478 3116.0360 3121.1227 3121.2758 3121.8024 3133.8334 3136.7886 3145.0112 3148.4477 3162.7354 3166.0226 3377.6244
redmass: 4.1529 4.4941 3.9297 5.1556 4.5985 4.5764 5.8726 5.7977 2.9575 4.6991 3.8123 3.9212 6.2701 2.0452 3.1299 7.4480 2.8209 2.8174 3.2821 3.6525 3.3243 3.9078 4.3885 5.1209 6.2450 6.3310 3.7917 1.1795 1.7903 1.8037 1.8992 1.9282 3.2996 3.8514 1.2470 1.2492 1.7764 2.0444 1.7299 1.4670 3.1423 1.7192 1.3856 1.3863 6.2705 6.2096 1.3203 1.3123 2.2359 2.2008 4.9431 1.6036 1.7157 2.4538 1.0949 1.0966 1.9160 1.1641 1.1177 1.1187 1.6346 2.0722 2.4218 1.4097 1.5258 1.2771 1.2701 1.3796 8.0343 8.1578 2.1780 2.0312 1.1062 1.1486 2.2182 2.2995 1.6820 5.9752 6.4336 6.4887 6.0852 6.1214 9.3064 1.0868 1.0617 1.0606 1.0996 1.1002 1.0867 1.0864 1.0867 1.0881 1.0914 1.0911 1.0961 1.0960 1.1015 1.1015 1.0756
irintensity: 0.6973 1.0334 0.5073 3.0685 4.4447 0.6307 0.1918 2.2441 4.7351 6.7820 12.6655 1.1554 5.9007 0.5888 7.5519 3.9962 0.0034 0.1162 2.7309 23.9517 3.5315 6.5904 15.4048 0.9832 0.0209 0.0195 27.9607 37.5242 76.5270 35.3152 50.3984 15.6884 7.3164 4.9071 0.1204 0.0066 6.1170 1.9651 0.6145 2.4555 29.4913 23.4836 0.2199 0.0799 0.0171 0.7487 0.9791 0.2388 8.2219 4.7924 49.1452 13.4691 18.4620 9.2271 16.9316 6.5265 199.3678 19.9319 0.2739 2.4177 8.3219 5.0173 16.1173 2.9795 0.1576 4.4698 0.3387 5.8548 0.0165 0.9294 8.0046 8.8977 25.1135 20.5356 17.9268 20.7608 238.8921 1.5365 4.0359 5.3898 24.8655 6.3330 345.0293 41.3738 20.5807 12.1201 8.0724 3.5392 7.5939 6.2080 1.4392 2.9431 11.3587 7.8090 39.3438 34.3381 25.4981 18.7176 9.4041
temp: 298.150 k
press: 1.00000 atm
elementType: 8 7 7 6 6 6 6 6 6 6 6 6 6 6 6 6 6 6 6 1 1 1 1 1 1 1 1 1 1 1 1 1 1 1 1
symmnumber: 1
zpe: 736069.6 jmol-1
zpe.correction: 0.280354 hartree
zpe.thermalcorrener: 0.297527 hartree
zpe.thermalcorrenthalpy: 0.298471 hartree
zpe.thermalcorrgfe: 0.230067 hartree
zpe.sumelectzpe: -802.652894 hartree
zpe.sumelectthermal: -802.635721 hartree
zpe.sumelectthermalent: -802.634777 hartree
zpe.sumelectthermalfe: -802.703181 hartree
dipole: 0.4351 -5.5579 -1.0862
dipole: 5.6797
quadrupole: -102.3534 -125.6684 -100.2740
quadrupole: -1.8255 -2.1824 -1.5684
quadrupole: 7.0785 -16.2365 9.1579 -1.8255 -2.1824 -1.5684
hfenergy: -802.9332483 hartree
pointgroup: C01 [X(C16H16N2O1)]
dipole: 0.2616669 2.1649386 0.4877738 debye
polarizability: 209.4651713|-28.4471684|191.8669325|8.8724991|4.3994256|171.4173799 unknown
InChI: InChI=1S/C16H16N2O/c19-16(13-15-9-5-2-6-10-15)18-17-12-11-14-7-3-1-4-8-14/h1-10,12,18H,11,13H2
charge 0 multiplicity 1
35 atoms
O  1.462186 -3.514086 -0.321983
N  0.871821 -1.348847 0.380118
N  -0.476287 -1.64974 0.564197
C  3.524711 -0.381165 0.164178
C  3.2330 -1.824603 -0.210114
C  -3.593482 -0.076334 0.240046
C  -2.729501 -0.92998 1.171787
C  3.42964 0.654977 -0.803476
C  3.883427 -0.033077 1.49428
C  1.771646 -2.32534 -0.058737
C  -4.545698 0.837452 0.755639
C  -3.453327 -0.195449 -1.167556
C  -1.252941 -0.675485 0.970232
C  3.682937 2.000589 -0.452794
C  4.137889 1.311242 1.848435
C  -5.346404 1.614628 -0.113822
C  -4.252419 0.577606 -2.037848
C  4.037192 2.33347 0.875605
C  -5.202106 1.4868 -1.513953
H  3.502156 -2.020643 -1.264495
H  3.842748 -2.520578 0.39474
H  -3.000149 -0.712473 2.223609
H  -2.909766 -2.006431 0.99711
H  3.163367 0.402177 -1.837263
H  3.970051 -0.822075 2.251513
H  -4.665421 0.937999 1.841758
H  -2.719635 -0.901109 -1.576072
H  -0.888811 0.35735 1.151528
H  3.610119 2.785284 -1.214089
H  4.419638 1.559839 2.877767
H  -6.08066 2.314817 0.300639
H  -4.137967 0.470888 -3.12265
H  4.238688 3.375359 1.147849
H  1.235776 -0.400664 0.56328
H  -5.822518 2.086402 -2.189457
